{"text_format":"1","workbook":"xlsx","n_sheets":7,"sheets":["Eingabe","Berechnung WR","Moduldatenbank","Wechselrichterdaten","Berechnung Speicher","Autarkiegrad","Eigenverbrauch"],"not_rendered":{"charts":0,"images":2,"macros":1,"external_links":0,"defined_names":2,"comments":0,"pivot_tables":0},"unopened":[],"bounds":{"document_bytes":16777216,"sheet_cells":100000,"rows_first":2000,"rows_last":500,"rows_between":2000,"halvings":0,"cell_chars":16384,"cell_head_chars":4096},"cells_cut":0,"cells_raw":0,"read":"whole","date_system":"1900"}

{"sheet":"Eingabe","index":0,"n_rows":49,"n_cols":23,"rows_kept":49,"cut":false,"hidden":false,"merged":[[48,1,48,16],[15,6,15,8],[4,6,4,9],[23,10,23,11],[46,9,46,16],[46,1,46,6],[12,6,12,9],[25,11,25,12],[25,14,25,15]]}
[]
[null,null,"WECHSELRICHTER UND SPEICHER AUSLEGUNG"]
[null,null,"Grunddaten",null,null,null,null,null,null,null,null,"Einstellungen"]
[]
[null,null,"Modulauswahl",null,null,null,null,null,null,null,null,null,null,"Cos ϕ",null,{"$f":"W5/100","v":1},null,null,null,null,null,null,100]
[]
[null,null,"Min./Max. Modultemperatur",null,null,null,{"$f":"H7-(H7*2)","v":-30},30,{"$f":"J7","v":50},50,null,null,null,"Einspeisung %",null,{"$f":"W7/100","v":0.7},null,null,null,130,null,null,70]
[]
[]
[null,null,"Wechselrichter",null,null,null,null,null,null,null,null,null,null,"Min. Leistungsverhältnis",null,{"$f":"S10/100","v":0.9},null,null,90]
[]
[]
[null,null,"Speicherauswahl",null,null,null,null,null,null,null,null,null,null,"Max. Leistungsverhältnis",null,{"$f":"T7/100","v":1.3}]
[]
[null,null,"Verbrauch"]
[null,null,"Stromverbrauch",null,null,null,5397,null,null,"kWh"]
[]
[]
[]
[]
[]
[]
[]
[null,null,"Verschaltung",null,null,null,"MPPT A",null,"MPPT B",null,"Gesamt"]
[]
[null,null,"Anzahl Stränge",null,null,null,1,null,1,null,null,"Nennleistung",null,null,"Betrieb"]
[null,null,null,null,null,null,null,null,null,null,null,"Min.",{"$f":"'Berechnung WR'!H8","v":9},null,"Min.",{"$f":"'Berechnung WR'!H7","v":6}]
[null,null,"Anzahl PV Module",null,null,null,12,2,12,null,null,"Max",{"$f":"'Berechnung WR'!K9","v":17},null,"Max",{"$f":"'Berechnung WR'!K9","v":17}]
[]
[null,null,"Gesamtanzahl der PV Module",null,null,null,{"$f":"G26*G28","v":12},null,{"$f":"I26*I28","v":12},null,{"$f":"G30+I30","v":24}]
[null,null,"Leistung PV Generator",null,null,null,{"$f":"'Berechnung WR'!C8","v":5040},"W",{"$f":"'Berechnung WR'!C10","v":5040},"W",{"$f":"G31+I31","v":10080},"W",{"$f":"IF(G31<7501,\"OK\",IF(G31<8176,\"WARNUNG\",\"ACHTUNG\"))","v":"OK"},{"$f":"IF(I31<7501,\"OK\",IF(I31<8176,\"WARNUNG\",\"ACHTUNG\"))","v":"OK"}]
[]
[null,null,"Leistungsverhältnis",null,null,null,null,null,null,null,{"$f":"Eingabe!K31/Wechselrichterdaten!J2/P5","v":1.26},null,{"$f":"IF(K33<P13,\"OK\",\"WARNUNG\")","v":"OK"}]
[null,null,"Min. MPP Spannung Wechselrichter",null,null,null,{"$f":"Wechselrichterdaten!F2","v":240},"V",{"$f":"G34","v":240},"V"]
[]
[null,null,"Min. MPP Spannung PV Generator ",null,null,null,{"$f":"'Berechnung WR'!H14","v":354.48750000000001},"V",{"$f":"'Berechnung WR'!H16","v":354.48750000000001},"V",null,null,{"$f":"IF(G36>G34,\"OK\",\"ACHTUNG\")","v":"OK"},{"$f":"IF(I36>0,IF(I36>=I34,\"OK\",\"ACHTUNG\"),\"\")","v":"OK"}]
[null,null,"Max. MPP Spannung Wechselrichter",null,null,null,{"$f":"Wechselrichterdaten!G2","v":800},"V",{"$f":"G37","v":800},"V"]
[]
[null,null,"Max. MPP Spannung PV Generator ",null,null,null,{"$f":"'Berechnung WR'!H20","v":430.11149999999998},"V",{"$f":"'Berechnung WR'!H22","v":430.11149999999998},"V",null,null,{"$f":"IF(G39<G37,\"OK\",\"ACHTUNG\")","v":"OK"},{"$f":"IF(I39>0,IF(I39<=I37,\"OK\",\"ACHTUNG\"),\"\")","v":"OK"}]
[null,null,"Max. Eingangsspannung Wechselrichter",null,null,null,{"$f":"Wechselrichterdaten!C2","v":1000},"V",{"$f":"G40","v":1000},"V",{"$f":"IF(I31>3300,800,800)","v":800}]
[null,null,"Max. Eingangsspannung PV Generator ",null,null,null,{"$f":"'Berechnung WR'!H27","v":520.20150000000001},"V",{"$f":"'Berechnung WR'!H29","v":520.20150000000001},"V",null,null,{"$f":"IF(G41<G40,\"OK\",\"ACHTUNG\")","v":"OK"},{"$f":"IF(I41>0,IF(I41<=I40,\"OK\",\"ACHTUNG\"),\"\")","v":"OK"}]
[null,null,"Max. Generatorstrom Wechselrichter",null,null,null,{"$f":"IF(G30>0,Wechselrichterdaten!H2,0)","v":26},"A",{"$f":"IF(I30>0,Wechselrichterdaten!I2,0)","v":14},"A"]
[null,null,"Max. Generatorstrom PV Generator",null,null,null,{"$f":"'Berechnung WR'!I34","v":14.425971000000002},"A",{"$f":"'Berechnung WR'!I36","v":14.425971000000002},"A",null,null,{"$f":"IF(G43<G42,\"OK\",\"ACHTUNG\")","v":"OK"},{"$f":"IF(I43>0,IF(I43<=I42,\"OK\",\"ACHTUNG\"),\"\")","v":"ACHTUNG"}]
[]
[null,null,"Eigenverbrauch",null,null,null,null,null,null,"  Autarkie"]
[]
[null,{"$f":"'Berechnung Speicher'!G14","v":0.39935235763229399},null,null,null,null,null,null,null,{"$f":"'Berechnung Speicher'!F7","v":0.71561075219429304}]
[]
[null,"Der Ersteller dieses Auslegungstoos übernimmt keinerlei Gewähr für die Aktualität, Korrektheit, Vollständigkeit oder Qualität der bereitgestellten Informationen. Haftungsansprüche gegen den Autor, welche sich auf Schäden materieller oder ideeller Art beziehen, die durch die Nutzung oder Nichtnutzung der dargebotenen Informationen bzw. durch die Nutzung fehlerhafter und unvollständiger Informationen verursacht wurden, sind grundsätzlich ausgeschlossen."]

{"sheet":"Berechnung WR","index":1,"n_rows":38,"n_cols":11,"rows_kept":38,"cut":false,"hidden":true,"merged":[[7,3,11,3]]}
[]
[]
[null,"Ausgewähltes Modul"]
[null,4,null,"Leistung","MPP Spannung","MPP Strom","Leerlaufspannung","Kurzschlussstrom","Pmpp","VOC","Isc"]
[null,1,{"$f":"VLOOKUP(B5,Moduldatenbank!A2:J92,2)","v":"Jinko JKM420N-54HL4"},{"$f":"VLOOKUP(B5,Moduldatenbank!A2:J97,3)","v":420},{"$f":"VLOOKUP(B5,Moduldatenbank!A2:J97,4)","v":31.51},{"$f":"VLOOKUP(B5,Moduldatenbank!A2:J97,5)","v":13.33},{"$f":"VLOOKUP(B5,Moduldatenbank!A2:J97,6)","v":38.11},{"$f":"VLOOKUP(B5,Moduldatenbank!A2:J97,7)","v":14.07},{"$f":"VLOOKUP(B5,Moduldatenbank!A2:J97,8)","v":-0.3},{"$f":"VLOOKUP(B5,Moduldatenbank!A2:J97,9)","v":-0.25},{"$f":"VLOOKUP(B5,Moduldatenbank!A2:J97,10)","v":4.5999999999999999E-2}]
[]
[null,"Eingang A  Anzahl Module","Leistung String","Generatorleistung","Anzahl Stränge Eingang A",null,{"$f":"Wechselrichterdaten!E2/('Berechnung WR'!E5*'Berechnung WR'!G14)","v":5.4162699672061771},{"$f":"ROUNDUP(G7,0)","v":6}]
[null,{"$f":"Eingabe!G28*E8","v":12},{"$f":"B8*D5","v":5040},{"$f":"C8+C10+C12","v":{"$error":"#REF!"}},{"$f":"Eingabe!G26","v":1},null,{"$f":"Wechselrichterdaten!F2/('Berechnung WR'!E5*'Berechnung WR'!G14)","v":8.1244049508092662},{"$f":"ROUNDUP(G8,0)","v":9}]
[null,"Eingang B Anzahl Module",null,null,"Anzahl Stränge Eingang B",null,{"$f":"Wechselrichterdaten!C2/('Berechnung WR'!G5*'Berechnung WR'!G27)","v":23.067984233032778},{"$f":"ROUNDDOWN(G9,0)","v":23},{"$f":"ROUNDDOWN(7500/D5,0)","v":17},{"$f":"ROUNDDOWN(G10,0)","v":22},{"$f":"MIN(H9:J9)","v":17}]
[null,{"$f":"Eingabe!I28*E10","v":12},{"$f":"B10*D5","v":5040},null,{"$f":"Eingabe!I26","v":1},null,{"$f":"Wechselrichterdaten!G2/('Berechnung WR'!E5*'Berechnung WR'!G20)","v":22.319793820904579}]
[null,"Eingang C Anzahl Module",null,null,"Anzahl Stränge Eingang C"]
[null,{"$f":"Eingabe!#REF!*E12","v":{"$error":"#REF!"}},{"$f":"B12*D5","v":{"$error":"#REF!"}},null,{"$f":"Eingabe!#REF!","v":{"$error":"#REF!"}}]
[]
[null,"Min. MPP Spannung PV Generator ( 70°C ) Eingang A",25,{"$f":"Eingabe!I7","v":50},{"$f":"D14-C14","v":25},{"$f":"E14*J5","v":-6.25},{"$f":"(100+F14)/100","v":0.9375},{"$f":"E5*G14*B8/E8","v":354.48750000000001}]
[]
[null,"Min. MPP Spannung PV Generator ( 70°C ) Eingang B",25,{"$f":"Eingabe!I7","v":50},{"$f":"D16-C16","v":25},{"$f":"E16*J5","v":-6.25},{"$f":"(100+F16)/100","v":0.9375},{"$f":"E5*G16*B10/E10","v":354.48750000000001}]
[]
[null,"Min. MPP Spannung PV Generator ( 70°C ) Eingang C",25,{"$f":"Eingabe!I7","v":50},{"$f":"D18-C18","v":25},{"$f":"E18*J5","v":-6.25},{"$f":"(100+F18)/100","v":0.9375},{"$f":"E5*G18*B12/E12","v":{"$error":"#REF!"}}]
[]
[null,"Max. MPP Spannung PV Generator ( -10°C >) Eingang A",25,{"$f":"Eingabe!G7","v":-30},{"$f":"C20-D20","v":55},{"$f":"E20*J5","v":-13.75},{"$f":"(100-F20)/100","v":1.1375},{"$f":"E5*G20*B8/E8","v":430.11149999999998}]
[]
[null,"Max. MPP Spannung PV Generator ( -10°C >) Eingang B",25,{"$f":"Eingabe!G7","v":-30},{"$f":"C22-D22","v":55},{"$f":"E22*J5","v":-13.75},{"$f":"(100-F22)/100","v":1.1375},{"$f":"E5*G22*B10/E10","v":430.11149999999998}]
[]
[null,"Max. MPP Spannung PV Generator ( -10°C >) Eingang C",25,{"$f":"Eingabe!G7","v":-30},{"$f":"C24-D24","v":55},{"$f":"E24*J5","v":-13.75},{"$f":"(100-F24)/100","v":1.1375},{"$f":"E5*G24*B12/E12","v":{"$error":"#REF!"}}]
[]
[]
[null,"Max. Eingangsspannung PV Generator ( -40°C) Eingang A",25,{"$f":"Eingabe!G7","v":-30},{"$f":"C27-D27","v":55},{"$f":"E27*J5","v":-13.75},{"$f":"(100-F27)/100","v":1.1375},{"$f":"G5*G27*B8/E8","v":520.20150000000001}]
[]
[null,"Max. Eingangsspannung PV Generator ( -40°C) Eingang B",25,{"$f":"Eingabe!G7","v":-30},{"$f":"C29-D29","v":55},{"$f":"E29*J5","v":-13.75},{"$f":"(100-F29)/100","v":1.1375},{"$f":"G5*G29*B10/E10","v":520.20150000000001}]
[]
[null,"Max. Eingangsspannung PV Generator ( -40°C) Eingang C",25,{"$f":"Eingabe!G7","v":-30},{"$f":"C31-D31","v":55},{"$f":"E31*J5","v":-13.75},{"$f":"(100-F31)/100","v":1.1375},{"$f":"G5*G31*B12/E12","v":{"$error":"#REF!"}}]
[]
[]
[null,"Max. Generatorstrom PV Generator Eingang A",25,{"$f":"Eingabe!G7","v":-30},{"$f":"D34-C34","v":-55},{"$f":"E34*K5","v":-2.5299999999999998},{"$f":"(100-F34)/100","v":1.0253000000000001},{"$f":"H5*G34*Eingabe!G26","v":14.425971000000002},{"$f":"IF(B8=0,0,H34)","v":14.425971000000002}]
[]
[null,"Max. Generatorstrom PV Generator Eingang B",25,{"$f":"Eingabe!G7","v":-30},{"$f":"D36-C36","v":-55},{"$f":"E36*K5","v":-2.5299999999999998},{"$f":"(100-F36)/100","v":1.0253000000000001},{"$f":"H5*G36*Eingabe!I26","v":14.425971000000002},{"$f":"IF(B10=0,0,H36)","v":14.425971000000002}]
[]
[null,"Max. Generatorstrom PV Generator Eingang C",25,{"$f":"Eingabe!G7","v":-30},{"$f":"D38-C38","v":-55},{"$f":"E38*K5","v":-2.5299999999999998},{"$f":"(100-F38)/100","v":1.0253000000000001},{"$f":"H5*G38*Eingabe!#REF!","v":{"$error":"#REF!"}},{"$f":"IF(B12=0,0,H38)","v":{"$error":"#REF!"}}]

{"sheet":"Moduldatenbank","index":2,"n_rows":58,"n_cols":10,"rows_kept":58,"cut":false,"hidden":false,"merged":[]}
[null,null,"Leistung","MPP Spannung","MPP Strom","Leerlaufspannung","Kurzschlussstrom","Pmpp","VOC","Isc"]
[1,"Jinko JKM420N-54HL4",420,31.51,13.33,38.11,14.07,-0.3,-0.25,4.5999999999999999E-2]
[2,"EGing 400W, EG-M54-HLV",400,31.28,12.79,37.18,13.54,-0.35,-0.27500000000000002,0.05]
[3,"EGing 395W, EG-M54-HLV, black",395,30.82,12.82,36.770000000000003,13.55,-0.35,-0.27500000000000002,0.05]
[4,"Q CELLS Mono Q.PEAK DUO G8 360 Wp",360,34.85,10.33,41.19,10.84,-0.35,-0.27,0.04]
[5,"Q Cells Q.PEAK DUO ML-G9 390 Wp",390,38.01,10.26,45.06,10.71,-0.35,-0.27,0.04]
[6,"Q CELLS Q.PEAK DUO ML G10 410 Wp",410,38.11,10.76,45.13,11.22,-0.34,-0.27,0.04]
[7]
[8]
[9]
[10]
[11]
[12]
[13]
[14]
[15]
[16]
[17]
[18]
[19]
[20]
[21]
[22]
[23]
[24]
[25]
[26]
[27]
[28]
[29]
[30]
[31]
[32]
[33]
[34]
[35]
[36]
[37]
[38]
[39]
[40]
[41]
[42]
[43]
[44]
[45]
[46]
[47]
[48]
[49]
[50]
[51]
[52]
[53]
[54]
[55]
[56]
[57]

{"sheet":"Wechselrichterdaten","index":3,"n_rows":31,"n_cols":10,"rows_kept":31,"cut":false,"hidden":true,"merged":[]}
[null,"Wecheselrichterdaten","Max. Eingansspannung","Max. DC_Leistung","Eingangsspannung MIN","Eingangsspannung MPPT MIN bei AC-Nennausgangsleistung","Eingangsspannung MPPT MAX bei AC-Nennausgangsleistung","Max. Eingangsstrom pro Mppt (A)","Max. Eingangsstrom pro Mppt (B)","Nennausgangsleistung"]
["Ergebnis",{"$f":"VLOOKUP(B31,A3:J21,2)","v":"H3-8.0-E"},{"$f":"VLOOKUP(B31,A3:J21,3)","v":1000},{"$f":"VLOOKUP(B31,A3:J21,4)","v":10400},{"$f":"VLOOKUP(B31,A3:J21,5)","v":160},{"$f":"VLOOKUP(B31,A3:J21,6)","v":240},{"$f":"VLOOKUP(B31,A3:J21,7)","v":800},{"$f":"VLOOKUP(B31,A3:J21,8)","v":26},{"$f":"VLOOKUP(B31,A3:J21,9)","v":14},{"$f":"VLOOKUP(B31,A3:J21,10)","v":8000}]
[1,"H1-3.0-E",600,3900,75,80,550,13.5,13.5,3000]
[2,"H1-3.7-E",600,4680,75,80,550,13.5,13.5,3680]
[3,"H1-4.6-E",600,5980,75,80,550,13.5,13.5,4600]
[4,"H3-5.0-E",1000,7500,160,240,800,14,14,5000]
[5,"H3-6.0-E",1000,9000,160,250,800,14,14,6000]
[6,"H3-8.0-E",1000,10400,160,240,800,26,14,8000]
[7,"H3-10.0-E",1000,13000,160,280,800,26,14,10000]
[8,"H3-12.0-E",1000,15000,160,320,800,26,14,12000]
[9]
[10]
[11]
[12]
[13]
[14]
[15]
[16]
[17]
[18]
[19]
[]
[]
[]
[]
[]
[]
[]
[]
[]
[null,6]

{"sheet":"Berechnung Speicher","index":4,"n_rows":43,"n_cols":7,"rows_kept":43,"cut":false,"hidden":true,"merged":[[21,0,21,2],[6,4,7,4],[13,4,14,4],[6,5,7,5],[6,6,7,6],[13,5,14,5],[13,6,14,6]]}
[]
["Nutzbare Speicherkapazität",{"$f":"VLOOKUP(B43,A23:C27,3)","v":7.7760000000000007},"kWh",null,"Spalten","PV-Leistung ","in kWp/MWh Jahresstrombedarf"]
["Stromverbrauch",{"$f":"Eingabe!G16","v":5397},"Wh",{"$f":"B3/1000","v":5.3970000000000002},"Zeilen","nutzbare Speicherkapazität","in kWh/MWh Jahresstrombedarf"]
["KWp",{"$f":"Eingabe!K31","v":10080},"Wp",{"$f":"B4/1000","v":10.08}]
[]
[]
["spezifische PV-Leistung",{"$f":"D4/D3","v":1.867704280155642},"kWp/MWh","Spalten","Autarkiegrad",{"$f":"INDEX(Autarkiegrad!B2:CD82,MATCH(B7,Autarkiegrad!A2:A82,1),MATCH(B8,Autarkiegrad!B1:CD1,-1))","v":0.71561075219429304},{"$f":"F7","v":0.71561075219429304}]
["nutzbare Speicherkapazität",{"$f":"B2/D3","v":1.4408004446914953},"kWh/MWh","Zeilen"]
["Stromverbrauch",{"$f":"B3","v":5397}]
["Direktverbrauch"]
["Batterieantladung"]
["Netzbezug",{"$f":"B9-B9*G7","v":1534.8487704074005},{"$f":"B12/B9","v":0.28438924780570696}]
[]
["spezifische PV-Leistung",{"$f":"D4/D3","v":1.867704280155642},"kWp/MWh","Zeilen","Eigenverbrauch",{"$f":"INDEX(Eigenverbrauch!B2:CD82,MATCH(B8,Eigenverbrauch!A2:A82,1),MATCH(B7,Eigenverbrauch!B1:CD1,-1))","v":0.39935235763229399},{"$f":"F14","v":0.39935235763229399}]
["nutzbare Speicherkapazität",{"$f":"B2/D3","v":1.4408004446914953},"kWh/MWh","Spalten"]
["Direktverbrauch"]
["Batterieentladung"]
["Netzeinspeisung"]
[]
[]
[]
["Speichertypen"]
[1,"5,76 kWh (1x CM2900 1xCS2900)",5.1840000000000002]
[2,"8,64 kWh (1x CM2900 2xCS2900)",7.7760000000000007]
[3,"11,52 kWh (1x CM2900 3xCS2900)",10.368]
[4,"14,40 kWh (1x CM2900 4xCS2900)",12.96]
[5,"17,28 kWh (1x CM2900 5xCS2900)",15.552000000000001]
[6,"20,16 kWh (1x CM2900 6xCS2900)",18.144000000000002]
[7,"23,04 kWh (1x CM2900 6xCS2900)",20.736000000000001]
[8]
[9]
[10]
[11,"8,06 kWh (1x CM4100 1xCS4100)",7.2540000000000004]
[12,"12,09 kWh (1x CM4100 2xCS4100)",10.881]
[13,"16,12 kWh (1x CM4100 3xCS4100)",14.507999999999997]
[14,"20,15 kWh (1x CM4100 4xCS4100)",18.134999999999994]
[15,"24,18 kWh (1x CM4100 5xCS4100)",21.761999999999993]
[16,"28,21 kWh (1x CM4100 6xCS4100)",25.388999999999992]
[17]
[18]
[19]
[20]
["Ausgewähleter Speicher:",2,{"$f":"VLOOKUP(B43,A23:C42,2)","v":"8,64 kWh (1x CM2900 2xCS2900)"}]

{"sheet":"Autarkiegrad","index":5,"n_rows":82,"n_cols":82,"rows_kept":82,"cut":false,"hidden":true,"merged":[]}
[null,5,4.9375,4.875,4.8125,4.75,4.6875,4.625,4.5625,4.5,4.4375,4.375,4.3125,4.25,4.1875,4.125,4.0625,4,3.9375,3.875,3.8125,3.75,3.6875,3.625,3.5625,3.5,3.4375,3.375,3.3125,3.25,3.1875,3.125,3.0625,3,2.9375,2.875,2.8125,2.75,2.6875,2.625,2.5625,2.5,2.4375,2.375,2.3125,2.25,2.1875,2.125,2.0625,2,1.9375,1.875,1.8125,1.75,1.6875,1.625,1.5625,1.5,1.4375,1.375,1.3125,1.25,1.1875,1.125,1.0625,1,0.9375,0.875,0.8125,0.75,0.6875,0.625,0.5625,0.5,0.4375,0.375,0.3125,0.25,0.1875,0.125,6.25E-2,0]
[0,0.41067385123141198,0.41010580618349501,0.40952622097144598,0.40893586501010598,0.408332865668737,0.40771690721786402,0.407088566725403,0.40644879704911901,0.40579636994297402,0.40513130534743602,0.40445117182750401,0.40375518742467997,0.40304186557948002,0.40231324390247603,0.40156844204042402,0.40080549551038902,0.40002477104644701,0.39922513555702899,0.39840576850317,0.39756709357944497,0.39670958372989701,0.39583194657065501,0.39493436687045003,0.39401504400669002,0.393073884099646,0.39210947862707801,0.39111840881681398,0.39009953875929199,0.389050894339525,0.387972270125583,0.386861738246705,0.38571843575566001,0.384537911171145,0.38331781073822502,0.38205667815348199,0.38075662915457098,0.37941518066832203,0.37802560146596398,0.37658639915063102,0.37509589945684202,0.373550876247009,0.37194884802223499,0.37028438707070699,0.36855725777750398,0.36676073491692301,0.36489481319057399,0.36295148241055902,0.36093380503582201,0.35882275930947799,0.35661365709029902,0.35430324301426602,0.35188330723779698,0.34934437186919598,0.34666903729504001,0.34384879991739897,0.34087677395585497,0.33774672319519999,0.33444510516992898,0.33095486009870101,0.32725220917575099,0.32331625481465898,0.31911510649831099,0.314620019187699,0.30977306746926297,0.304528040093408,0.29886511448776498,0.292725120840229,0.28600557992855602,0.278612560979976,0.270376634096683,0.26102113177152297,0.25012381492870001,0.237515078326167,0.22308912025490699,0.20663971904260001,0.187805494507811,0.16596160752779299,0.13990858307486601,0.10702745038528801,6.1634027679739301E-2,0]
[6.25E-2,0.43569097220720598,0.43518694092446802,0.43467016617330501,0.43414145404488602,0.43360200087963102,0.43304862947478001,0.432481204750927,0.43189611417707102,0.43129805064668297,0.43068480484445498,0.43005935554796498,0.429419890446954,0.42876422977268702,0.42809386106616598,0.427405630184091,0.42669914942818199,0.425971786480556,0.42522773135261999,0.424465979646307,0.42368195862184499,0.42287156642039903,0.42203661268683901,0.42117953244591899,0.42030249038202899,0.41940524365752002,0.41848080696453999,0.41752975660295499,0.41655374242480298,0.415544298463976,0.41450477540333602,0.41344045269875601,0.41234084840697799,0.41120769392197098,0.41003832678982799,0.40883372047654298,0.407592929625471,0.406303794774799,0.40497216366578898,0.403587751990926,0.40214846841888302,0.40065555239748901,0.39910989649166501,0.39750366645039098,0.39584283497393602,0.39412659470158201,0.39234758966927302,0.39050031184429501,0.38858647378015898,0.38658603584579498,0.38449563339715997,0.38231504210492201,0.38002513795750997,0.37760771586422998,0.37505851993161099,0.37237524058167798,0.36955328175148699,0.36658688160076403,0.363440592773981,0.36011540604001901,0.35656363135326002,0.35273774899722299,0.34865229312150597,0.34427116780425099,0.339551346830476,0.33445947234652201,0.32892728634455298,0.32294247706988699,0.316391174659791,0.309082300901242,0.30095040025678299,0.291921363767912,0.28165322055437098,0.26956268325986499,0.255052635123795,0.237897231195702,0.217339001588924,0.19259997246803601,0.16139499520824399,0.119498955449039,6.3700668562018406E-2,0]
[0.125,0.45742989023256297,0.45693864362485898,0.45643659655614199,0.45592359037122199,0.45539720077673301,0.45485801680673499,0.454307286542523,0.45374640268347599,0.45317440903455802,0.45258937429718998,0.45198350433270101,0.45135298031926802,0.45070243647716401,0.45003376544859103,0.44934998446503399,0.44864723564512199,0.44793012799946702,0.44719434132345398,0.44643497253223302,0.445654854755832,0.44485506262569202,0.44403497048753199,0.44319332959978203,0.44233162376899698,0.44143104689228002,0.44050210690175701,0.43954360070605097,0.43856086771987501,0.43754281868393802,0.436489200658223,0.43540956920551999,0.43429687420399699,0.43315731546283798,0.43197476076052099,0.43075824098683002,0.429510611169934,0.42822328367927198,0.42689823717974201,0.42551810942646501,0.42408734754751698,0.42261554246698302,0.42109676769910798,0.41952841909129002,0.41790010552860901,0.41621281281713302,0.414478601626316,0.41266629543800898,0.41078176882617001,0.408817859642504,0.40675758574645099,0.40459322184109903,0.40231821036359799,0.39994320944672301,0.39745351176924598,0.39480598931414501,0.39201043835970001,0.38906743895552898,0.38595007137826698,0.38259540859380498,0.37901140589186999,0.37519594125668099,0.37112204603901899,0.36679545882452802,0.36213217035294099,0.35697298814281597,0.35139327913623603,0.34534591817438998,0.33864024105024298,0.33120162196205,0.322963763500488,0.31382572381108398,0.30342541180559501,0.29123707256521503,0.27672041115164198,0.25842894235477298,0.23550738092426499,0.20748985486122001,0.170445659111812,0.122534762050978,6.3700668562018406E-2,0]
[0.1875,0.477721416528813,0.47722941337567498,0.47672928781604401,0.476216244824677,0.47569188839576698,0.47514396542501702,0.47458362554489902,0.47400732649865501,0.47341744365729499,0.47281344552819998,0.47218858233872602,0.47154527860371198,0.47087467367414398,0.47018219582842102,0.469473631341083,0.46875451648650202,0.46802216855567602,0.46726946012246501,0.46649133155655498,0.46568228477380003,0.46485555517063398,0.46400631569120898,0.46313768367278502,0.462247187933291,0.461338468229962,0.46040528253333701,0.459437935744129,0.45844559556582498,0.45742450641930699,0.45636464984218,0.45528331890238599,0.454166936120461,0.453022496057018,0.45183962852111198,0.45061887421861102,0.449347530818341,0.44803240846721398,0.44667755501066703,0.44528066210728501,0.44384289508297498,0.44236519694061899,0.44083951769659901,0.43927568886118501,0.43766245672947601,0.43599738714567898,0.43427220519205301,0.43245973920373698,0.43057682711814299,0.42857679672903498,0.426455124258945,0.42423671959477399,0.42192705958050403,0.41950645151521798,0.41698317412719699,0.41432219859738101,0.41148139505173198,0.40850280417107798,0.40528214317991801,0.40189290900796598,0.39831524361949,0.39453425100537698,0.39049648304156698,0.38608489401163698,0.381290785565018,0.37613173137570299,0.37052350134641299,0.36440075110876602,0.35750010545671601,0.34990557335185402,0.34140734500479297,0.331837316570256,0.3209527035261,0.30813376331970299,0.29293074653361201,0.27340242815314297,0.248593412142911,0.21665771277042001,0.175372598881292,0.124093446005813,6.3700668562018406E-2,0]
[0.25,0.49705462476105899,0.496535050694629,0.49600060150992897,0.49544887669544302,0.49488273378263897,0.49429976077728199,0.49370582185184497,0.49310328036421602,0.49248623989146201,0.49185652280999898,0.491209384230128,0.49054390632056,0.48986344600262999,0.489168531946783,0.48845094287188601,0.48771438328516098,0.48695814463301501,0.486181526791511,0.485382483011154,0.48456160610610799,0.48372253587699798,0.48286000184503203,0.48197683345105802,0.48106850660899397,0.48013578062060103,0.47917124313986798,0.47817768858117199,0.477163750736742,0.47612147178839598,0.47504612864469198,0.47394113775560198,0.47279958741413203,0.471634082578964,0.47043197303693102,0.46918151894535198,0.46789068240834197,0.46655753777441,0.465200025561606,0.46379886083764099,0.462361609236633,0.46088861023086197,0.45936231231072799,0.45779153917520599,0.45615056781255497,0.45441292891002599,0.45259613826130202,0.45068104774726803,0.44866527143863499,0.44655322735367597,0.44436263827317402,0.44210839258053403,0.43975176801030402,0.437292887958113,0.43470476533082703,0.43198046611645602,0.429145607341895,0.42614796000291699,0.42291457531285098,0.41948977430879503,0.41586642273133401,0.411939034736794,0.40775908415770701,0.40326583551976602,0.39842276930690301,0.39314867694705502,0.38748437321381302,0.38122989322565198,0.374182418458049,0.366281429400028,0.35744799456239901,0.34748629449332102,0.33597537822572998,0.322575532493869,0.30605089264400198,0.28508499570965801,0.258410971367242,0.22315951910985701,0.17859455819780001,0.12470870003669,6.3700668562018406E-2,0]
[0.3125,0.51566514652269602,0.51513020901683904,0.51458235946298803,0.51401932657709903,0.51344155013904702,0.51284554653124703,0.51224049914888803,0.51162679069606298,0.51099926414779895,0.51033206234953798,0.50964647032649901,0.50894656044040898,0.50822938187373101,0.50749835011488598,0.50675318262998004,0.50599226697608402,0.50521516078024298,0.50441033220863796,0.503584309654455,0.50274267276260298,0.50188443170289998,0.50100881185269197,0.50010904296772796,0.499190288680259,0.49824960081285802,0.49727120376850797,0.496262941482015,0.495215077144886,0.49413210770023103,0.49302130975453101,0.49189066091642902,0.49074195585515501,0.48954995987716998,0.48832447973300902,0.48707244589623599,0.48578063943119998,0.48445167786258198,0.48305481251191801,0.48161077155085202,0.48010933996295502,0.47854912996822802,0.476932722946807,0.47527477355995801,0.47355585695345198,0.47175250747330799,0.46984221385317398,0.467856475096323,0.46577577048822799,0.46359558003844897,0.46133666989283001,0.45899358044942601,0.45657627542469198,0.45407110103571102,0.45145571463623302,0.44868600285855798,0.445747722461042,0.44264391853631502,0.43933820838750698,0.43577857480545501,0.43201654540234202,0.428022327191736,0.423734209207005,0.41916551480157599,0.41421407436734797,0.40884424391990398,0.40300613331505702,0.396590909034506,0.38928174562291401,0.38114982116870599,0.37196623423678399,0.361514919997307,0.34942691172953999,0.33529736063464499,0.31738412850236403,0.295018313966947,0.26574551699631599,0.22807018608129501,0.18085980245303299,0.124793411976085,6.3700668562018406E-2,0]
[0.375,0.53397701257480801,0.53342166759866405,0.53284969776124802,0.53226705354877402,0.53165655823789704,0.53102289915348899,0.53037387204602404,0.52971370088769298,0.52904219792088503,0.52835564681860003,0.52765089241415897,0.52692389596397404,0.52618371095025096,0.52542671060672097,0.52465673106189803,0.523867287590706,0.52306931661132605,0.52225014693769301,0.52140955014732804,0.52054708023971896,0.51966253324300704,0.51876176446375799,0.51784421891777599,0.51690494414778798,0.51593279752801102,0.51491495387601904,0.51386946205046202,0.51280223483076603,0.51171725643122801,0.51060794671617504,0.50947157749199601,0.50829603240884902,0.50707808421240197,0.50580213021104303,0.50448547364118501,0.50313694767060202,0.50171211417908601,0.50022756771663901,0.49871184471776198,0.497161493529508,0.49556997275028303,0.49392427808484102,0.49220588986658598,0.49038845922982699,0.48848554844560999,0.48652601728332201,0.48448903195323101,0.48233787433083197,0.48009085503514498,0.47777233418576598,0.475407747858479,0.47294086900551802,0.47036522474088099,0.46764143674309,0.464731149143643,0.46172500265621302,0.45852011737227799,0.45503882060241402,0.451374778807762,0.44752868560659897,0.44337317072864701,0.43899782548766902,0.43436101604910399,0.429266276872935,0.42367555227223802,0.41768654423846502,0.41103662365166699,0.40349591784517702,0.39508270819547697,0.385480908344012,0.37444161359268302,0.36178729019587602,0.34672324918494302,0.32762786413453998,0.30355063812576299,0.27185780252754799,0.231917732779408,0.182351087993644,0.124793411976085,6.3700668562018406E-2,0]
[0.4375,0.55199441948856498,0.55140520534945803,0.55080407133504605,0.55019048366419798,0.54956679152463905,0.54891455159037905,0.54824099131829496,0.54755740891029903,0.54685706024325798,0.54614262892778698,0.54541320424974205,0.54467446673772602,0.54392281634953499,0.54315573995219901,0.542377956608599,0.54158045617179795,0.54076006898626405,0.53990999644937399,0.53903827926651005,0.53814375728377095,0.53722716239494706,0.53629575935737805,0.53533556532118298,0.534365479709215,0.533370474106859,0.53234203680556802,0.531280412315418,0.53019134510457999,0.52907046060534901,0.52790662139078104,0.526714026797097,0.52547606260306901,0.52419499648601497,0.52286105045447595,0.52147610818683499,0.52006139918143102,0.51860359235949904,0.51710126480345597,0.51555363701875101,0.51392887087685102,0.51225255738809905,0.51052045403708501,0.50873603951331903,0.50689246497776197,0.504971913454208,0.50295299699787299,0.50083077811814602,0.49860695281591699,0.49629224972394398,0.49391705052503698,0.49148099041994298,0.488920545809505,0.48624012623726598,0.48341530260464199,0.48046669773908801,0.477314817890235,0.47390927320405102,0.47030978450769101,0.46651293346991701,0.462555192994,0.45836887363807,0.45391096047268098,0.44912558696199101,0.443809391635897,0.43808340889160102,0.431894097046846,0.424938458285543,0.41721932969522102,0.408306953152615,0.398296504310233,0.38669510741485902,0.37342454244567702,0.35710289447538301,0.337023792978627,0.31102163702636498,0.277094502968803,0.23485985763800901,0.18328199151080399,0.124793411976085,6.3700668562018406E-2,0]
[0.5,0.56983278312229202,0.56921433866629301,0.56858510997216405,0.56794550277778599,0.56729301380844699,0.56661902386075702,0.56593606626500903,0.56524526796590802,0.56453906314443203,0.56381496754800697,0.56307594988992204,0.562327431350096,0.56156635113043396,0.56078702772631395,0.55997907706468597,0.55914311073219403,0.55828233482117595,0.55740659480256105,0.55651340215211897,0.55558613989463101,0.55463961559984798,0.55368175377583895,0.55270051199510395,0.55169877920335098,0.55067067170962103,0.54960133122607802,0.54847312104222301,0.54730809795274704,0.54612349777596503,0.54491703038654904,0.54368261456601197,0.54239855107994195,0.541078890215833,0.539717955194285,0.53831400847616395,0.53684127501375001,0.53531362752259704,0.53372945696755303,0.53210319922496097,0.53044716653123902,0.52873668570232901,0.526978019311373,0.52517187321085301,0.52330457527824603,0.52129484500291901,0.51913725404350497,0.51692357797036503,0.51465318748010502,0.51227934244254802,0.50981646400154301,0.50727226546219795,0.50465005242072503,0.50192624158658905,0.49901023025499203,0.49585728001378798,0.49252464161217901,0.48898737475245702,0.48528444160596501,0.481423772727267,0.47743631517155399,0.473157941100811,0.468500673584057,0.46356665641060302,0.45809290911200101,0.45215475431199498,0.445620937616582,0.438543104853863,0.43029400265532902,0.42120025579359999,0.41055485430809402,0.39846806499895199,0.38431469887832098,0.36689257443787598,0.34558766387387602,0.31766364998104601,0.281837261067446,0.23727107162827299,0.183753723699176,0.124793411976085,6.3700668562018406E-2,0]
[0.5625,0.58750721675755202,0.58688710325215399,0.58624845479771504,0.58559900987656999,0.58493775165482298,0.58425383059029901,0.58356108535656903,0.58286103314821402,0.582149429531996,0.58142384083302801,0.58068154497283997,0.57988913956709898,0.57908381638888495,0.57825819025015801,0.57741776466080197,0.57656507127265499,0.57568825625887898,0.57477810778487104,0.57383506150797203,0.57287866408485499,0.57190506900272298,0.57090853871520197,0.56986785992659195,0.56879879861481397,0.56770937253089804,0.56659176289430302,0.56543454222632095,0.56425241609088395,0.56304463545207695,0.56179649847087598,0.56050990639184695,0.55917459076615805,0.55778622259709199,0.55636431756824101,0.55490303746744596,0.55339121811793901,0.55183519870997699,0.55023775510691497,0.54859045613980995,0.54688655541208298,0.54515183736797801,0.54336718922712102,0.54148587197678799,0.53944984163078102,0.53733341391786804,0.53514236984417696,0.53287945445323304,0.53051028309023995,0.52806084227384698,0.52553145656236799,0.52293591512986104,0.52023355349183098,0.51736877680398996,0.51426127213429096,0.51094842102196703,0.50750303421100795,0.50390959338325503,0.50015485764021805,0.496257858115771,0.492167738845326,0.48766443804579201,0.482939717038812,0.47779910896074501,0.47210607109708302,0.46588725938783898,0.45916094122352102,0.45165421086902502,0.44318684546930298,0.43357138218577801,0.422460454831177,0.40980342476077303,0.39442201954247402,0.37631126978988799,0.35329226304649802,0.32337798145123398,0.28585675581873798,0.23906540653626801,0.18387577171790701,0.124793411976085,6.3700668562018406E-2,0]
[0.625,0.60511434368678996,0.60448497007926905,0.60384464510532798,0.60319399124418505,0.60253180095588099,0.60184980191482096,0.60115074518644396,0.60042429873198599,0.59966141320512301,0.59888278606452705,0.59808944757511495,0.59728710513730399,0.59646625850914403,0.59562052698618795,0.59474015572874095,0.59384717004505905,0.59293225735275801,0.59198170490596103,0.59100017463605603,0.58997907905219005,0.58894189241458905,0.58789356656636804,0.58683311840506303,0.58574618677335699,0.58463912417396202,0.583504662940177,0.58231215985326501,0.581066061016422,0.57977426612765204,0.57845434224139602,0.57712015816411399,0.57575505514429703,0.57433781676037698,0.572879293472776,0.57139835328982402,0.56987832413950101,0.56830277251449401,0.56666346528015998,0.56497386934377103,0.56323264032211795,0.56141804983381505,0.55952351285452295,0.55751509045644898,0.55542175800229698,0.553264141901738,0.55100654411991701,0.54866014949494601,0.54622406697495796,0.54370754433975799,0.54110221844705797,0.53839543749359098,0.53555063769996802,0.53252023658849901,0.52927268502073199,0.52588419104463802,0.52239801064522096,0.51875022435458196,0.51495157988024798,0.51094428323899599,0.506627619794076,0.50208258797932803,0.49715384619220498,0.49176667590490603,0.48586059593525999,0.47937331800122901,0.47234926016213802,0.46454367884032999,0.45568406293497299,0.445635050065609,0.43401958314317701,0.420520169184257,0.404149278459213,0.38497779210237998,0.36020803722705302,0.32855329978889303,0.289198747491206,0.240378791036955,0.183876932061045,0.124793411976085,6.3700668562018406E-2,0]
[0.6875,0.62270193112453598,0.62207126082319497,0.62141224345464796,0.62072858731779601,0.62003122851842196,0.61930044374405302,0.61855613491280304,0.61780215930986604,0.61702859775588104,0.61622629003679397,0.61540652575855903,0.61456491302796101,0.61369853327912505,0.61280330144970196,0.61188675631994505,0.61094010656815101,0.60996092793699297,0.60896679971562695,0.60795603940102005,0.60693061205087095,0.60587757881493798,0.60481136222308196,0.60372103241672603,0.60260180871209001,0.601429308864737,0.600200537466547,0.59894402105574396,0.59765702217132199,0.59634994928329699,0.59501981553281802,0.59365636448147396,0.59225409728721501,0.59082160957755003,0.589359905639117,0.58785687226847105,0.58627062035210797,0.58463202563373895,0.58294442863509499,0.58118862466473598,0.57939155336585801,0.57746846528148599,0.57546358158982802,0.57342553249653905,0.57128873439669303,0.56906603823431401,0.56672420165083603,0.56429428035776996,0.56177436356385202,0.55916655938200399,0.55647815425560898,0.55364017705066904,0.55064728408720398,0.54748565023599505,0.54418879344002102,0.54075689303280505,0.53720894783496698,0.53352461262844997,0.52960012126782396,0.52539961753160802,0.52101803013779102,0.51630806553142305,0.51111931264614596,0.50554790521154502,0.49933744257803397,0.49259210588310598,0.48531903940980797,0.47714187168893901,0.46793321113624697,0.45738777886181903,0.44515077382757201,0.43069041843105699,0.41358780036711401,0.39314617050466799,0.36648223515113798,0.333395431161645,0.29198561482838697,0.24116971637175799,0.183876932061045,0.124793411976085,6.3700668562018406E-2,0]
[0.75,0.64018183975769605,0.63951526478526399,0.63882750605661498,0.63812302740419802,0.63739974767090102,0.63664175534926004,0.63587185156140003,0.63508552835891396,0.63427504641724697,0.63342384131158003,0.63254808843497301,0.63165899191812303,0.63073872896368999,0.62979961196735501,0.62885012085393299,0.62788843189981502,0.62690504001938496,0.62589064944602801,0.62484958301509896,0.62379337626236198,0.62269657583723603,0.62158264982880196,0.62040764022872297,0.61921369266206505,0.61800774925497703,0.61677600295039503,0.615516839326539,0.61421440001517102,0.61287212475710495,0.61151119268674703,0.61013585743893595,0.60872001422560695,0.60724926282342295,0.60572113911887104,0.60415015073424605,0.60251855454371805,0.60081436387281895,0.59906880968256304,0.59727321644692499,0.59533968871158605,0.59337275063668005,0.59132632461039203,0.58923618657635501,0.58702929854555996,0.58468504524632703,0.58226428339064595,0.57976023824765199,0.57716451563756899,0.57449920652011399,0.57165935230371001,0.56869120634455805,0.56557790633243099,0.56238362892691396,0.55903149562119603,0.55554080271060702,0.55196119549552403,0.54813837002958099,0.54405969834821399,0.53976260186647096,0.53524447438834799,0.53027493237529499,0.52492155922630801,0.51901876392828605,0.51257645989117695,0.50564335152700601,0.49795252954640201,0.48946286715039,0.47986570932577699,0.46878064559141902,0.45589767895780198,0.44033779006530099,0.42255594044149702,0.40063745216087099,0.37233476772943902,0.33768411392308201,0.29420805773674402,0.241652827372733,0.183876932061045,0.124793411976085,6.3700668562018406E-2,0]
[0.8125,0.65738522621278905,0.65668239277680696,0.65596195436024896,0.65522441701497702,0.65447556074066204,0.65369559134592403,0.65287574600278597,0.65204179944029705,0.65118229105385705,0.65029239993625099,0.64938950959076502,0.64847895898821495,0.64755938965635496,0.64661579502198996,0.64564077611965798,0.64465213637159802,0.64363262583655301,0.64257984906758303,0.641501808513534,0.64039734779783297,0.63924395058231698,0.63807396130285998,0.63689218988425,0.63570036829445997,0.63449624772857305,0.63324551859136802,0.63195167475680503,0.63062556314978502,0.62927958076566803,0.62788686129388604,0.62647203326544598,0.62499995784639395,0.62347696785066897,0.62188807939278601,0.62025816381599996,0.61859044617116499,0.61687699083978498,0.61505199025645196,0.61314621802648095,0.61117783001414605,0.609171366054029,0.60708267198333499,0.60486261391052898,0.60256072404927696,0.60016396901086699,0.59766477498458304,0.59510959311176004,0.59244089303279701,0.58962448349405805,0.58666939675071805,0.58359848179368901,0.58046151473725005,0.57719263115395003,0.573801139533481,0.57027415590449104,0.56655085796432603,0.56257813669756696,0.55839757711390003,0.55400648395113705,0.54922694454288601,0.54407958202009499,0.538389251812178,0.53230400248960996,0.52567561468170598,0.51836161928133495,0.51040275597020901,0.50157632149241405,0.491548921355975,0.4798136691605,0.46608956437645099,0.44985581828563298,0.43101861743896103,0.407281391879114,0.37782305551626899,0.34141048555129699,0.29591868442742802,0.24183164919806699,0.183876932061045,0.124793411976085,6.3700668562018406E-2,0]
[0.875,0.674016677947471,0.67329794344385197,0.67255197106054498,0.671789608636707,0.670997239641973,0.67016578964872697,0.66931880271705801,0.668463773052273,0.66759537379045597,0.66670938604383501,0.66579453547579504,0.66486208067969299,0.66391815510306096,0.66293952490595398,0.66193759942274399,0.660913373687812,0.65986962871026,0.65879999804866196,0.65767813458906099,0.65654230107197198,0.65539409015262295,0.65423459091339797,0.653062093923785,0.65184713310768205,0.650614982588825,0.64935595858538697,0.64805355997894298,0.64670312946664898,0.64531684841424597,0.64390378964156603,0.64244441356603699,0.64090084202675002,0.63932487041520003,0.63772174628776201,0.63609507519680897,0.63440506092620497,0.63258763561183495,0.630694389659198,0.62874886078602299,0.62675336926592295,0.624637128553444,0.62244688846509499,0.620192515273155,0.61783544619837205,0.61540129490942197,0.61290830186789702,0.61025093936667596,0.60746795883625604,0.604546497923801,0.60151747230104102,0.59843301311853803,0.595221863904005,0.59194269712730496,0.58851403818973502,0.58483509455744498,0.58097164007438296,0.57692076886376897,0.57263782468789004,0.56801047605644805,0.56303831758101297,0.55757082126648505,0.55171303040589303,0.54540496477296896,0.53849279417047902,0.530861788813355,0.52258147203486405,0.51348888426254702,0.50284889260815002,0.490494032677881,0.47584659417899899,0.45900678733174199,0.43897923871435302,0.41343107459058098,0.38279618602531001,0.34475012822152301,0.29726648975954001,0.24186399465018699,0.183876932061045,0.124793411976085,6.3700668562018406E-2,0]
[0.9375,0.68945175750820598,0.68870098939705304,0.68791701842031805,0.687122529835277,0.68631686859631102,0.68548670227321296,0.68464139675196001,0.68377902417826197,0.68289567220937697,0.681990089791634,0.68106697931912497,0.68012041369960596,0.67915102117297199,0.678173455906807,0.67718303772955402,0.67616249213383095,0.675091804807748,0.67400485069111205,0.67290278647003798,0.671787821288655,0.67065143105941105,0.66947471824905502,0.66828351688189003,0.66707809092308501,0.66582961863378698,0.66455167532282799,0.66323016587032302,0.66187821648396405,0.66046764118620305,0.65899767317298596,0.65751343341032797,0.65600206895122903,0.65445817456944899,0.65285266912251405,0.65119577816405805,0.64940635293035298,0.64755025205318795,0.64562429051913495,0.64359778441794402,0.641532952039924,0.63939940445415699,0.63719158927789299,0.63491189077740395,0.63257936305984597,0.63015369239316499,0.62758871661312299,0.62487852776835096,0.62205286850851604,0.61911476836319401,0.61609912510311704,0.61297607556752798,0.60978351144618803,0.60646845614997302,0.60289219322227705,0.59911537635429002,0.595212233041163,0.59104975492488998,0.58658275769263202,0.58177054251804505,0.57650533808020299,0.57089220434533305,0.56481235614288305,0.55831853540977205,0.55109553946704104,0.54320142952883099,0.53461949748173898,0.52513900304516703,0.51387076830098599,0.50078426149276301,0.48535191832180202,0.46774038567999798,0.44623644175989202,0.419274063776229,0.38725905848256997,0.34751879177088502,0.298160486242038,0.24186399465018699,0.183876932061045,0.124793411976085,6.3700668562018406E-2,0]
[1,0.70340503331128001,0.70264805992516199,0.70187408945369401,0.70109221543937805,0.70028946179252805,0.69946147543066295,0.69861093648997696,0.69775155228173302,0.69685732475377204,0.69594050864701396,0.69501622076815806,0.69408588500064405,0.693149533459542,0.692175357507403,0.69117261931089602,0.690159254305592,0.68912733492904699,0.68808200146870502,0.68700086999998999,0.68588932184212104,0.68476471790308802,0.68360313175679499,0.68240931370642199,0.68119895253793195,0.679962469258522,0.67868995888934702,0.67735563487883399,0.67595313637657095,0.67453736624920901,0.67310827338341295,0.671661219313474,0.67015878980153998,0.66861934955750102,0.66696947075601798,0.66524570419058104,0.66342531380197001,0.66152013398380105,0.65956562175751599,0.65757683605065598,0.65550280755271695,0.65334634728575303,0.65114628361679106,0.64889116560137805,0.646521123156931,0.64403533314024397,0.64140535139169796,0.63868330507879401,0.63585246709404397,0.63293526337226702,0.62992950880333398,0.62686608544278499,0.62369129776475996,0.62028908129981297,0.61674276217171098,0.61301711619414301,0.60904978635291696,0.60479674382389503,0.60020227784674995,0.59511341391782802,0.58970678388041098,0.58386288293416999,0.57760581684691603,0.57088185238731104,0.56333964378625601,0.55519171143854895,0.546424894754033,0.53634348215431804,0.52443289364686896,0.51065059039155702,0.49464156652149999,0.47608651945671998,0.45291422547967902,0.42487358293744298,0.39132012420075402,0.34963184435015898,0.29879404110390301,0.24186399465018699,0.183876932061045,0.124793411976085,6.3700668562018406E-2,0]
[1.0625,0.71669326886541296,0.71591940668887999,0.71512935067883698,0.71432501881367005,0.713511140682907,0.71265059985615098,0.71177520356927804,0.71089366774902896,0.70999961755172003,0.70909732818848703,0.70818484761142997,0.70723428547257405,0.70626413396142296,0.70528695341084602,0.70430052376714603,0.70330377912964903,0.70226334144923197,0.70120163046686501,0.700111487165195,0.69899204933436798,0.69785652459786396,0.696695295676098,0.69551429095122697,0.69431034595049301,0.69305054178294301,0.69172881363794103,0.69038292585698902,0.68901887942402495,0.68764291998201699,0.68623093698686299,0.68480390055738305,0.68331079963790597,0.68170761525472301,0.67999490182927402,0.67821814364353805,0.67636917358547299,0.674495086801292,0.67256478853948898,0.67054339026629295,0.668486417304618,0.66640474350955503,0.66425901603306003,0.66199162093076602,0.65960102643260399,0.65705599002229897,0.65441721218244098,0.65166804698987901,0.64884270367993901,0.64594939577816401,0.642983212544053,0.63990211616668002,0.63660204045904001,0.63321234667503701,0.62974849571019298,0.62601823703496096,0.62203082420161504,0.61769759776656896,0.61288579683046096,0.60772464526935199,0.60213610192781897,0.59620591032219405,0.58989477321311101,0.58287785421124005,0.57526553517262702,0.566943241226741,0.55786081121406506,0.54718779375873705,0.53463896861315396,0.52017860600178001,0.50345405870184701,0.483759222867926,0.45905834873439599,0.43022212776420599,0.39505015442687202,0.35149593582096,0.299075717716133,0.24186399465018699,0.183876932061045,0.124793411976085,6.3700668562018406E-2,0]
[1.125,0.729496645014163,0.72871089913988896,0.72789350629294103,0.72706103161181901,0.72621949356822901,0.725359360685501,0.72449371598692702,0.72362195969179799,0.72272995621777003,0.72179778224489,0.72084632883003197,0.71988893575650104,0.71892646486321898,0.71794900312882304,0.71693698433640995,0.71590217190899896,0.71483860405984601,0.71374125819313805,0.71262789904877899,0.71148591388645499,0.71031989701548304,0.70913649307594695,0.70791095762061595,0.70664563480275999,0.70536637675066904,0.70406612157932502,0.70274814687780596,0.70139175756878003,0.70001787357130196,0.69861242430820103,0.69713194506249998,0.69551401496510501,0.69380393271591501,0.69205608585844403,0.69027577550179098,0.68844244870412596,0.68653486562490296,0.68454416247115801,0.68253652427292699,0.68050753680204201,0.67840816866246501,0.67620001356049197,0.67387489495245001,0.67143952236985505,0.66891876435042896,0.66628913398690803,0.66357830333873902,0.66080664696505997,0.65795242734497394,0.65496561201637005,0.65179971536396397,0.648545948895765,0.64523826525221695,0.64177740756537904,0.63811932016207196,0.63412920819191698,0.62962515111998196,0.62472927124511202,0.61937598345284695,0.61371649785129301,0.60775531271277405,0.60120241225786197,0.594115575233923,0.58634230570457702,0.57791921997939399,0.56847605859196304,0.55722737163940295,0.54434732700087596,0.52937209678490504,0.51194425665384502,0.49081963283775099,0.464883501058098,0.43509204030195597,0.39830358780090003,0.35303893056859798,0.29917286522130299,0.24186399465018699,0.183876932061045,0.124793411976085,6.3700668562018406E-2,0]
[1.1875,0.74169957294157596,0.74090038946859105,0.74009618222773599,0.73928504436422504,0.73846502106177903,0.73762580884969098,0.73676672473635896,0.73587346981653801,0.734944985912795,0.73401272733180301,0.73307217583724704,0.73211219993824295,0.73112244396785997,0.73010366682189598,0.72906476635436701,0.72800134447182496,0.72691083716765603,0.72579091892146097,0.72464719655569299,0.72348102754521204,0.72227481359140799,0.72103964365413797,0.71978654203752601,0.71852535150621399,0.71725618840229,0.71595142518841504,0.71462112457168103,0.71325959665917205,0.71182975902078605,0.71031877834084001,0.70869527847935698,0.70703382526992797,0.70531943644155803,0.70357076623811299,0.70178045087004604,0.69989896479719005,0.69796818015005102,0.69600648875988702,0.69399327789439202,0.69190331477363698,0.68973640020806704,0.68743839849259303,0.68506852386260297,0.68258200584177298,0.680006084789891,0.67737179981633899,0.67468589429824,0.67190588419957797,0.66901221412085898,0.66596875407010303,0.66283443411867105,0.65964650904481303,0.65631238889804699,0.65283681083289902,0.64914669522201196,0.64505611341440905,0.64048886662318805,0.63538359174051395,0.62994555586474299,0.62427058502090105,0.61818032083521601,0.61146430103611504,0.60429973517823499,0.59650097332700003,0.58793129059242699,0.57802928181170299,0.56644316219153901,0.55326186377758402,0.53789413857988999,0.519718774012498,0.497399130085865,0.47044783997092998,0.43937300555497899,0.40094205743466499,0.35414582427283597,0.29917515399797801,0.24186399465018699,0.183876932061045,0.124793411976085,6.3700668562018406E-2,0]
[1.25,0.75332385366375998,0.75253425137829,0.75173798795200997,0.750933986969471,0.75010267603401304,0.74924178766900595,0.74834986772148704,0.74745146821657804,0.74653063751420801,0.74559987194432897,0.74462704563648496,0.74363900436609898,0.742631238023301,0.74161017534904505,0.74055918816393096,0.73947802819308095,0.73838258026750203,0.73725552073766498,0.73608984277990996,0.73490227287361298,0.73368072574578702,0.73245272691565,0.73121973346466995,0.72995728094783996,0.72867201163366602,0.72735717473191097,0.72597542125140602,0.72453429859498497,0.72298705304251598,0.72136936975259103,0.71971747004838504,0.71802116430203899,0.71627471036518997,0.714464059043732,0.71261491454799597,0.71071472868299701,0.70879449988204002,0.70682334741511299,0.70476232110854398,0.70260713050055801,0.70036390787672398,0.698057960006228,0.69563884265001497,0.69314126559203704,0.69056431122196704,0.68794890501147399,0.68519832619381604,0.68236757990455299,0.67941278063341504,0.67637354989701703,0.67330073593721895,0.67010333911412201,0.66676873515676705,0.66327648070279799,0.65943582947754498,0.65530314424291403,0.65052425510880796,0.64530182728429397,0.63985011425841198,0.63408735846718201,0.62776673173291297,0.62105281729399098,0.61373715890132496,0.60572445162689004,0.59686410607221996,0.58638618522683805,0.57477762727520898,0.56139854622915497,0.54565620530118097,0.52663079527221202,0.50313332088951701,0.47558151115720099,0.44326829851170302,0.40319376396858703,0.354929719712753,0.29917515399797801,0.24186399465018699,0.183876932061045,0.124793411976085,6.3700668562018406E-2,0]
[1.3125,0.76444739517267302,0.76366199203726604,0.76284974386776305,0.76203003560195004,0.76117342971359203,0.76029701424983098,0.759402278923762,0.75848874741161099,0.75752493110008001,0.75655778929177198,0.755561853821479,0.75455523650726597,0.75351634309890703,0.75246064698580195,0.75139570019469304,0.75029354765918199,0.74916289196940999,0.74802145108134499,0.74683810894860603,0.74564212468577495,0.74443995352650905,0.743218142685384,0.741978037455998,0.74071445570500605,0.73939283275780798,0.738027794051625,0.73659618174430197,0.73505951205650799,0.73348151677325701,0.73185772970226204,0.73019292815842196,0.728466387742296,0.72669499481513899,0.72488183387114402,0.72303489245441599,0.72114690651642399,0.71919657544520699,0.71714638088955396,0.71500841789987002,0.71279894047473302,0.71053048433296895,0.70814707623328799,0.705704006378996,0.70316716491871201,0.70057994085424202,0.69787450552071695,0.69509611465380605,0.69222014104770402,0.68925034726381795,0.68624612256770201,0.683133404196412,0.67989253001415395,0.67654551639796001,0.67290454625868301,0.66901261622434205,0.66475487898678598,0.65995013391455104,0.65477671759907796,0.64919896166774804,0.64323543317786802,0.636812819902975,0.62990814988341803,0.62250333630488597,0.61439227119465001,0.60492500371240199,0.59405643942912401,0.58226749346933204,0.56858915759839301,0.55256568827066199,0.532753799862136,0.50819853196761,0.480401947516433,0.44681181040683998,0.40521083981374501,0.355457069420204,0.29917515399797801,0.24186399465018699,0.183876932061045,0.124793411976085,6.3700668562018406E-2,0]
[1.375,0.77530075519984898,0.774497055001509,0.77366661941355896,0.772823039143678,0.77196122843707904,0.77105767801786695,0.77012380091483901,0.769171621757607,0.76819312347616797,0.76719746311164505,0.76616270519530205,0.76512322926249599,0.76407121252584798,0.76298606375866396,0.76188186568729599,0.76076810205225598,0.75962053021134301,0.75845320682908901,0.75727442246716103,0.75607302715609903,0.75484942617557604,0.75359339892811195,0.75229122503729895,0.750976246572017,0.74959340617427395,0.74815227277297303,0.74662415550374195,0.74504910070744301,0.74342807617976803,0.74175771712871696,0.74004101961319702,0.73830741564081204,0.73653755211291305,0.73474459794756897,0.73291819276102599,0.73100160846505002,0.72898963944358897,0.72687906924405399,0.72471289258917404,0.72247989213893105,0.72015318130819705,0.71775798457520301,0.71529795115718198,0.712764531345911,0.71010576972652295,0.70738789849665795,0.70457737832932799,0.70169381130033104,0.69876624906674001,0.69572757641518701,0.69257220790945995,0.68934272119370499,0.68582027112558697,0.68206152285649302,0.678006950026944,0.67366281581488396,0.66888215438390897,0.66369970303471104,0.65806964128235002,0.65188387389197799,0.645344950442857,0.63832437225977301,0.63067197681607801,0.62234222951128804,0.61230617273941201,0.60128596435465098,0.58922860104313302,0.57519351015829501,0.55857319878656497,0.53813413417828804,0.51278952690197299,0.48455511198860901,0.44978203686750101,0.406795682540954,0.35578300113544198,0.29917515399797801,0.24186399465018699,0.183876932061045,0.124793411976085,6.3700668562018406E-2,0]
[1.4375,0.78550842805541199,0.78468621800831895,0.78384342380712702,0.78296201044710401,0.78205727821639504,0.78112741305370903,0.78018350382905699,0.77920626807059101,0.77820394761119704,0.77719897365739599,0.77617359463443703,0.77511809321136704,0.77405249140624399,0.77298116632798597,0.77188328829942598,0.77075921520680002,0.76962109737935303,0.76846216602218798,0.76727243579750004,0.76603653495059099,0.76476472868873902,0.763486679247105,0.76216305454648803,0.76079669880315404,0.75934511237320002,0.75783362916170005,0.75627107719867603,0.75465068761583998,0.75297768665925502,0.75128642024174797,0.74958667214452701,0.74783607834655597,0.74606469972114398,0.74423899597305299,0.74234448456164404,0.74034639440234096,0.73827253455381003,0.73613544826897404,0.73394546623484302,0.73167398992293697,0.72933784112217204,0.72692998397318298,0.72444648753146501,0.72183483833606699,0.71914478350830202,0.71638237124098603,0.71355494222872895,0.71068211504330203,0.70770043271582805,0.70461690567015201,0.70149027154532195,0.69810165195624696,0.69448996172705701,0.69061309968363105,0.68643703987141103,0.68207494179971495,0.67733670816836,0.67217868869352404,0.666424467339369,0.66016372621876396,0.65340321056222705,0.64611502865348303,0.63836873930195004,0.62953859848863303,0.61912885517467897,0.607985582021207,0.595553853309012,0.58125597391193196,0.56403600591827596,0.54278737443095604,0.51695809855914199,0.48796711803271797,0.45202135013193601,0.40810807817615202,0.35594012341048498,0.29917515399797801,0.24186399465018699,0.183876932061045,0.124793411976085,6.3700668562018406E-2,0]
[1.5,0.79524938508204202,0.79437896228378901,0.79349004729629102,0.792574060357495,0.79164639688743799,0.79066993599240698,0.78968385068648705,0.78869221831661196,0.78767108172439904,0.78662311359875003,0.78556942813131303,0.78451125624126505,0.78344724485394901,0.78235113241410104,0.78124879486407595,0.78013134859758304,0.77897948866163103,0.77777520003848899,0.77653861344459996,0.77529211927290897,0.77402686371539198,0.77269693205655798,0.77133389741995695,0.76987163397163605,0.76836814658979102,0.76680899469569197,0.76519092686203305,0.76353731368309197,0.76187557097520897,0.76020416240660205,0.75849094440810105,0.75673810344306702,0.75493960096722401,0.75305963063834003,0.75110105510756997,0.74907526810875402,0.74696847800564503,0.74482114305340497,0.74259882488706397,0.740300490128178,0.73795795408906895,0.73551828068810499,0.73298830890206301,0.73035977386602202,0.72764562692123702,0.72488402752940195,0.72206346592263904,0.71913979805824002,0.71612295555854599,0.71306147377231299,0.70981187683916303,0.70633104191992402,0.70256690024307,0.69853795624979598,0.69433066713574298,0.68994302845233602,0.68519653066915298,0.68002110374978497,0.67420394425090702,0.66785612702613895,0.660939865088088,0.65342157841453696,0.64536718295634998,0.63604042149663298,0.62557215297207203,0.614170757538409,0.60135461948660696,0.58673836749587005,0.56893076803453901,0.54682979791752495,0.52080296401809101,0.49099858458887402,0.45391743954493502,0.40915719042716597,0.356003021779492,0.29917515399797801,0.24186399465018699,0.183876932061045,0.124793411976085,6.3700668562018406E-2,0]
[1.5625,0.80439951462370096,0.80349768429400303,0.80257793532577004,0.80162462947778601,0.80066617409409602,0.79969748533017604,0.79870203335354595,0.79768145699239001,0.79665300125576599,0.79561488411033898,0.79457246477370302,0.79350303741656203,0.79242333203333704,0.79133514074394995,0.79021147428904603,0.78904144967324297,0.78783584278432195,0.78662217514465904,0.78539884589568398,0.78413866441082203,0.78284717714428997,0.78146442789413095,0.78001627861790102,0.77850388449697905,0.77694552325310295,0.77533908100850801,0.77371378483228703,0.77206680356414104,0.77041060273452999,0.768710635283821,0.76697193269585695,0.76517700527083798,0.76329664710523903,0.76134631722252399,0.75934563581152603,0.75725919547452403,0.75513312348161199,0.752941319574437,0.75070933952584695,0.74842662506790303,0.74601168441858701,0.74352824743239998,0.74096471015218501,0.73831722017213697,0.73562322045602202,0.73286622577574401,0.73000086201375403,0.727053695922522,0.72404764255836696,0.72088727293144295,0.71755739669618501,0.71393927224108,0.71004827282155203,0.70599494380029904,0.70172457638444696,0.69727653536541601,0.692531194097872,0.68720496509288198,0.68147710705938802,0.67503086974540905,0.66788212854708695,0.66028935601529104,0.65181671280098696,0.64208577581130499,0.63159668829481297,0.61992752851172805,0.60674982622262097,0.59173767227211305,0.57348746594030897,0.55067908979209301,0.52445187316100095,0.49375516624092902,0.45564051077242201,0.409957240732433,0.356003021779492,0.29917515399797801,0.24186399465018699,0.183876932061045,0.124793411976085,6.3700668562018406E-2,0]
[1.625,0.812953835483476,0.81201592826714197,0.81107153999971204,0.81011132928836105,0.80912678599162602,0.80812181750390799,0.80711258081416803,0.80609773548844499,0.80507570968698405,0.80403753150062096,0.80297861865432896,0.80191446579909298,0.80080754367656803,0.79966538984998004,0.798494879356624,0.79731695915969303,0.79612097129047998,0.79490911717955903,0.79366097465045304,0.79239330297338795,0.79101489531612801,0.78955749166179701,0.788041182732233,0.78647074652427595,0.78488602594701795,0.78329343795677897,0.78168869053558698,0.780061766376418,0.77839032312730605,0.77667771261497498,0.77490435219096299,0.773042634982677,0.77110971350457203,0.76911617502399898,0.76706407207260896,0.76496242841119499,0.76279923517099701,0.76059444068328697,0.75836366367511698,0.75598983691970101,0.75355227075360298,0.75102137199310104,0.74843690852049805,0.74580229282212795,0.74308334495553696,0.74026793164393501,0.73739349746799698,0.73445912589139795,0.73139607351114,0.72815299999402705,0.72468677748148502,0.72095696035312995,0.71700370395356305,0.71285204272857206,0.70853526514246801,0.70401974959104296,0.69923595666740301,0.693875778215714,0.68810432686134404,0.68160975789788003,0.67441308746951101,0.66651427030613397,0.65763563873308795,0.64777223003442896,0.63723496305396399,0.62522016736050501,0.61176489528733802,0.596399117985838,0.57762068718727899,0.55433939836017898,0.52787378054955603,0.496244373909354,0.45727726406407898,0.41052098243164398,0.356003021779492,0.29917515399797801,0.24186399465018699,0.183876932061045,0.124793411976085,6.3700668562018406E-2,0]
[1.6875,0.82100348650783705,0.82004911681405901,0.81907227827095097,0.818081646375861,0.81708739926645901,0.81608830975718205,0.81508547137940002,0.81407466675781304,0.81302960341576702,0.81198228196717603,0.81088457669681102,0.80975870760121804,0.80860453814887101,0.80744576281884906,0.80628332286924798,0.80511316345061801,0.80390560920703902,0.80268285935996797,0.80140315921893002,0.800042632995007,0.79858732235173602,0.79706248839836702,0.79550818555282199,0.79393838792457305,0.792360447723233,0.79077615673456803,0.78916833267908204,0.78749800871320097,0.78579340595069203,0.78402924196994295,0.78216853131991204,0.78024596345977204,0.77827209936780195,0.77625015359216798,0.77418762362348903,0.77206363725020499,0.76989866313181299,0.767682364150851,0.76536014453260304,0.76297416867177004,0.760475390149006,0.75793078541635905,0.75536465146076404,0.75269965710984799,0.74992067610772495,0.74710527161448903,0.74421718806873205,0.74124044521618304,0.73805679144657799,0.73472765879325397,0.73115631004703696,0.72739830754479795,0.72340001899258199,0.71921298403017098,0.71480144016838598,0.71017847262468303,0.70524687451776102,0.69992834590898201,0.69399394146950899,0.68746451265463104,0.68028790425713603,0.67206793937148401,0.66290780653706904,0.65311000995549495,0.64241072113521303,0.63014433072918996,0.61650778035544496,0.60071889589191396,0.58120648369024197,0.55780988398104603,0.53098427624619904,0.498183917800331,0.45868575961344099,0.410878956070587,0.356003021779492,0.29917515399797801,0.24186399465018699,0.183876932061045,0.124793411976085,6.3700668562018406E-2,0]
[1.75,0.82864676345990995,0.82767136695794497,0.82669295430502399,0.82571139178241304,0.82472729712467896,0.82373896399037605,0.82272215804714199,0.82169076369190996,0.82060605827576105,0.81949381200517502,0.81835160225075698,0.81720629900337904,0.81605571580557101,0.81489851146713799,0.81372690244385004,0.81252320714533,0.81130739895444004,0.80999753837167099,0.80860409758680796,0.80714518635454402,0.805619685353543,0.80407001243503295,0.80251538414837598,0.80095370609855698,0.79938637227043796,0.79779579675928503,0.79613773973373103,0.79443878094715303,0.79267740080536098,0.79082921820876895,0.78889450969199104,0.78692731213120903,0.78491781622508106,0.78286017518169504,0.78076404340811101,0.77861858277338303,0.77641047208803604,0.774113981707378,0.77179583898247095,0.76934619371115998,0.76684882257158704,0.76432788485960301,0.76173008043393198,0.75899274675820605,0.75621237834877797,0.75335802570282495,0.75043219164417696,0.74729541798291099,0.74404832821481603,0.740611343947575,0.73703234261202299,0.73320045869401695,0.72914384135029098,0.72488766288081596,0.72039409439818702,0.71570310781331403,0.71067039299122203,0.70522698779067505,0.69920262477403405,0.69263164138268896,0.68530397131119103,0.67695503472221696,0.66773723146561303,0.65792123740432396,0.64690446299486104,0.63435231104206802,0.62061351153474797,0.60452643230490999,0.58443035083966999,0.56109043459734698,0.53379178589586296,0.49982851688166702,0.459815335273416,0.411183046890084,0.356003021779492,0.29917515399797801,0.24186399465018699,0.183876932061045,0.124793411976085,6.3700668562018503E-2,0]
[1.8125,0.835632141047701,0.83467181960603298,0.83370816256198599,0.83274139232798405,0.83175747946659995,0.83074113008421302,0.82968384517826799,0.82859831922603799,0.827479043628359,0.82635754840328701,0.82523193454944599,0.82410033510816205,0.82296538838147204,0.82179784501164299,0.82062039392381303,0.81940529750816704,0.81809031358182605,0.81668554677388305,0.81521541980033696,0.81372886613399498,0.81222277963599898,0.81068941819067597,0.80914545480689803,0.80759395897886299,0.80600508967308904,0.80436121473677902,0.80267283880588203,0.80090857502912804,0.79905675904905804,0.797131992070503,0.79518001686015105,0.79319137315257604,0.79115160956672204,0.789078222327806,0.78696606088731003,0.78477884535243503,0.78250456592633899,0.78020268925832303,0.77779722019480801,0.77534416080446,0.77285635894655702,0.77030214079140602,0.76762148965528199,0.76489875309148503,0.76209775856214201,0.759234772520753,0.75615821225933899,0.75295466498729802,0.74956499406998001,0.74608789205270298,0.74248299102780002,0.73856575655842105,0.73443770232120098,0.73011102033906605,0.72555198298490797,0.72068692555089098,0.71561075219429304,0.709972523897346,0.703767317898087,0.69710963769808199,0.68963956749160504,0.68121334163377201,0.67202628143985499,0.66208226640293499,0.65075234439803398,0.63810185479904502,0.62412646913860104,0.60780925158530996,0.58724652785492404,0.563964132608471,0.53614078887216998,0.50135833377762895,0.46082028037938499,0.41143478676303202,0.356003021779492,0.29917515399797801,0.24186399465018699,0.183876932061045,0.124793411976085,6.3700668562018503E-2,0]
[1.875,0.84185383194669905,0.84089838236891101,0.83993571368732101,0.83892682567167698,0.83788820087863403,0.83681943191429897,0.83572192653867405,0.83461845839965898,0.83350766336153903,0.83239490344167799,0.83127806462050102,0.83014557993215199,0.82898846401687298,0.827827812234877,0.82659338402522997,0.82525928694115702,0.82383907673335899,0.82238171189801501,0.820919002972606,0.81945054424077601,0.81796040218613797,0.81644399228951003,0.81492319204007302,0.81334744274288795,0.81173162524440201,0.81007396216704497,0.80834510320598396,0.80650727761534702,0.804618035951567,0.80268815868991805,0.80072141829675603,0.79871281466657296,0.796668364250257,0.79456890744227804,0.79239520309901301,0.79014450855100704,0.78787923983270103,0.78551257951842302,0.78313665714425296,0.78071340502857101,0.77820984295893403,0.77556660653235898,0.77288739459635902,0.77013125045390896,0.76729300606935402,0.764287225473959,0.76115697835162899,0.757860898864685,0.75446707634982701,0.75100072984314004,0.74730858943350298,0.74340037213779597,0.73924383032523799,0.734810236688202,0.73013486774268799,0.72521302108094599,0.71993963596173405,0.71410074711935401,0.70786786565600002,0.70097078183378303,0.69329724512006397,0.68502357857232499,0.67604478015773295,0.66582841261255499,0.65420955798477898,0.64140801130912195,0.62710841847025001,0.61055654129662795,0.58977101229402096,0.56650224358679602,0.53815246144662399,0.50279892799346604,0.46164240637717102,0.411646286763032,0.356003021779492,0.29917515399797801,0.24186399465018699,0.183876932061045,0.124793411976085,6.3700668562018503E-2,0]
[1.9375,0.84768896944481797,0.84668824599852299,0.84565959824300896,0.84459996589789899,0.84351460497761499,0.84242104625731196,0.84132339534126899,0.840222046863075,0.83911368697810995,0.83800349562348997,0.83685862284915302,0.835707570074398,0.83453763381886004,0.83328441625899397,0.83191786688651204,0.83047931043641898,0.82902896790011704,0.82757219283593497,0.82611035472108196,0.82464265309720897,0.82315520656950403,0.82164470419411295,0.82006259233632195,0.81844639820004095,0.81678691780039203,0.81505805848485102,0.81322767518905303,0.81135206578553398,0.80943413583423796,0.80748254470252701,0.80549646104015704,0.80347895359122001,0.80140019142371399,0.79924816081579997,0.79704507254947998,0.79481780276184799,0.79249603044679295,0.79016396788690901,0.78782408303585005,0.78546401240908403,0.78295065528195795,0.78030980007820505,0.777607777604301,0.77480706030388702,0.77185985092019604,0.76875758050644605,0.76553770222750095,0.76218414473921003,0.75879561140580398,0.755213590795488,0.751483503190294,0.74759728584031504,0.74344617070071195,0.73903500392101895,0.73424014951720995,0.72920861353030897,0.72374873651525895,0.717723244859095,0.71135115671752802,0.70420920822928101,0.69638340513068298,0.68824490921566805,0.67933520304770401,0.66887434801614598,0.65712766378181198,0.64417408596131598,0.629607364934887,0.61268384987417102,0.59182960206035995,0.56845589182368805,0.53995722395740597,0.50419748679856402,0.462313039577323,0.41183261652488401,0.356003021779492,0.29917515399797801,0.24186399465018699,0.183876932061045,0.124793411976085,6.3700668562018503E-2,0]
[2,0.85286374011254495,0.85181652453913204,0.85074508357296097,0.84966434825568704,0.848578949781434,0.84748880398728299,0.846394760473413,0.84529739802038795,0.84417931601908602,0.84304044855349602,0.84189792595502499,0.84070710889841405,0.83944043573066596,0.83806969846302903,0.83664379083895901,0.83520856857925696,0.83376216196253905,0.83230922979195499,0.83085123944602102,0.82938696286394398,0.82788650143453602,0.82630554190995498,0.82468416921227605,0.82301564968895802,0.82127049219427495,0.81944774113576202,0.81758964445525195,0.815714334937654,0.81379832025582399,0.811817494659689,0.80983132616854603,0.80780785359296503,0.80566354488319802,0.80346942554642098,0.80124457354755996,0.79894052987072195,0.79663195467938996,0.79431416063243498,0.79197651652081402,0.78955782156950605,0.78710824218299702,0.78455870723801102,0.78186209896135594,0.77900872401843002,0.77597141127219804,0.77283042913386102,0.76956193004909001,0.76621336139206198,0.76274524735192994,0.75910226997686503,0.75531041622253703,0.75143251033251002,0.74728553160978495,0.74280514107270501,0.73796993742834505,0.73277440706030395,0.72709342515214503,0.72100931983831795,0.71438066005547396,0.70698864091879798,0.69918787445543296,0.69111210097557396,0.682135669684382,0.67155734863901695,0.65967078874028295,0.64656399483274896,0.63193731844582302,0.61451332405388204,0.593719244908404,0.57009540553586802,0.54148043773712196,0.50555233292346302,0.46282366597953201,0.41199124152488398,0.356003021779492,0.29917515399797801,0.24186399465018699,0.183876932061045,0.124793411976085,6.3700668562018503E-2,0]
[2.0625,0.857288569102996,0.85622032729241804,0.85514901595545501,0.85407458555806604,0.85299759789191598,0.85191660262325897,0.85083206256511201,0.84971069530629895,0.84858331721714098,0.847438903744125,0.84622804855413403,0.84491875414856499,0.843547251388435,0.84217333113264103,0.84079556293817104,0.83938551349566304,0.837949884184919,0.83650439102021801,0.83505346214964504,0.83356772654711297,0.832017482437447,0.83043092696535603,0.82876555828982301,0.82701700731866701,0.82519925831401597,0.82335908582960804,0.82150698219914198,0.81961439442695905,0.81769977481124001,0.81576600414002898,0.81378391255631999,0.81170040603184501,0.80953239269371102,0.807308174556846,0.80501563248242103,0.80271689485006104,0.80041122441769497,0.798082007304174,0.79567294628433605,0.79323990689086299,0.79080082861791801,0.78827735281789801,0.78556188231315405,0.78263778863059597,0.77962055701987598,0.77644408778882901,0.77321161072598699,0.769855615963006,0.76633707866662004,0.76264275419945204,0.75883793509639397,0.75488120043758,0.750748863595458,0.74625257083147301,0.74127717672957305,0.73587703946480498,0.73007399269209405,0.72380751970936796,0.71693352449040404,0.70948616635572403,0.70176717876376604,0.69372730935164595,0.68457161434189695,0.67396661769697097,0.66201125651004999,0.64874261667264399,0.63412188944909598,0.61626372884234504,0.59548887058376698,0.57158250855466597,0.54280578325527495,0.50671075569425605,0.46328275379947298,0.41211506741712001,0.356003021779492,0.29917515399797801,0.24186399465018699,0.183876932061045,0.124793411976085,6.3700668562018503E-2,0]
[2.125,0.861270051840208,0.86020375997398002,0.85913507190817895,0.85806339381066199,0.85698941988924904,0.85589485309109503,0.85478212691730204,0.85366567338830901,0.85248587498759798,0.85125440061333502,0.84989441631326201,0.84853000567940096,0.84716278254327104,0.84579281383153004,0.84441884313760895,0.84303667710603003,0.84163073009716904,0.84018812478341498,0.83870082276947999,0.83717741722565198,0.83560657003489502,0.83397700065687996,0.83226087546489103,0.83044155920995399,0.82860859563169798,0.82677098996736398,0.82489026921839104,0.82298323992830202,0.82107145955074101,0.81914193570599603,0.81712794993808802,0.81505855667403304,0.81288498536860099,0.81060370206988996,0.80831832568917406,0.80602700287604501,0.803715074016225,0.80132406590112404,0.79890841258113099,0.79648605944212303,0.79401418785797295,0.79146719815000999,0.78871003135919804,0.78576672361399202,0.78274087544087201,0.77963107450722802,0.77640370908235901,0.77302423225475003,0.76946346502540397,0.76575226555756504,0.76189417727057696,0.757915957990694,0.75379682333618103,0.74930822546625597,0.74424441122005802,0.73861606085004805,0.73272846836740202,0.72618982259655396,0.71908778407191798,0.71167443949980302,0.70401560369185301,0.69593340919934099,0.68679598124255203,0.67615929122106,0.66423814958128002,0.65083886818880698,0.63609922725566104,0.617932993436075,0.59719489205299603,0.57301853311147899,0.54412494876681095,0.50779500848089798,0.46367599440504398,0.41217696099887902,0.356003021779492,0.29917515399797801,0.24186399465018699,0.183876932061045,0.124793411976085,6.3700668562018503E-2,0]
[2.1875,0.86494151277613895,0.86387680176163495,0.86280980509662797,0.86173824418658895,0.860632068136302,0.85952287392291005,0.85838559474535803,0.85719934340898096,0.85589837283722403,0.85454337589433904,0.85318574017291404,0.85182519865797202,0.85046217655052303,0.84909666054031696,0.84772721043435295,0.846351501931078,0.84494794177575105,0.84350947094134698,0.84199554448869396,0.84042681035845102,0.83881585607457998,0.83714320628499805,0.83537044639483604,0.83358223718330005,0.83175024172332801,0.82987522105683198,0.82798385125283502,0.82607710370342902,0.82414744808988205,0.82214121735476697,0.82012803568095305,0.81805085956082402,0.81585230860828495,0.81360411142279998,0.81132452168236902,0.80903895705209505,0.80666204345833603,0.80425786815935596,0.80184607853359602,0.79938281746219297,0.79685404721223596,0.79424378402751095,0.79147148074759199,0.78853403123969801,0.78551966587992705,0.78249155636254597,0.77921639225252703,0.77580114134835398,0.77223170710087297,0.76852714664549004,0.76462506131246699,0.76061049357221999,0.75647431663808795,0.75198150550175502,0.74677409173287601,0.74106998245289202,0.73499392597680901,0.72822261991817905,0.72099275932595897,0.71363243866901604,0.70592092590494404,0.69769604637594396,0.68861980242097798,0.67796934566144695,0.66609227608105104,0.652762668460939,0.63783750701509401,0.61954003228723897,0.59882898054502498,0.57434425961737401,0.54535525223555203,0.50872021564904801,0.46399324440504303,0.41222983599887902,0.356003021779492,0.29917515399797801,0.24186399465018699,0.183876932061045,0.124793411976085,6.3700668562018503E-2,0]
[2.25,0.86835751820791496,0.867297790865313,0.86623590596784295,0.86515582974508398,0.86405223326995295,0.86288672613123996,0.86168824885907902,0.86038040879487399,0.85902976705490097,0.85767729789997205,0.85632249769453705,0.85496509416465905,0.85360457890869401,0.85224135055216499,0.85087535908414902,0.84947392309360104,0.84804098758254298,0.84656357286040596,0.84503032847969595,0.84345634417673299,0.84180644089210099,0.84007921499230298,0.83831872890186199,0.83654175835989097,0.83471947562359905,0.83284530441087401,0.83095921321223098,0.82902623861178804,0.82702181018563803,0.82501200401348196,0.82295279250787301,0.82083817862986097,0.818685449705706,0.81646749132701102,0.81421053648774,0.811889718111658,0.80949527866270499,0.80709117479673698,0.80463337718947703,0.80211320330469804,0.799520675580355,0.79686688097708103,0.79404303893509798,0.79115954870481497,0.78820883960131405,0.78515834184632005,0.78191876316465003,0.778459173275868,0.77492265130536497,0.77119008944162004,0.76724413801977998,0.76319618567099001,0.75900665161671299,0.75443095149882999,0.749068981247759,0.74331096749703296,0.73698274781992801,0.73003244455081595,0.72281284550973801,0.71545503068919902,0.70774264070233195,0.69937716786053605,0.69021143897090798,0.67967195659749002,0.66776377667988096,0.65456434416181397,0.63947663201509397,0.62106796107364404,0.60034017531918704,0.57563823996943098,0.54653922980638203,0.50955325692770004,0.46425816087062499,0.41228271099887898,0.356003021779492,0.29917515399797801,0.24186399465018699,0.183876932061045,0.124793411976085,6.3700668562018503E-2,0]
[2.3125,0.871399257987577,0.87034863191789802,0.86929475459670502,0.86818794086122997,0.86702693904036099,0.86580436525725901,0.86457038984095302,0.86324590124102996,0.86189930265021397,0.86055124933780902,0.859200680071175,0.85784676061613696,0.85649058376058496,0.85512387609048301,0.85372434361291805,0.85230147283165802,0.85081279242465102,0.84929411415320899,0.84776081994054797,0.84616808423657297,0.84449548491225201,0.84277516546273401,0.84102242092233903,0.83921079345112204,0.83739557104485196,0.83557395396340195,0.83365655286329898,0.83166310379595898,0.82966496898088504,0.82762142571016994,0.82555945557622101,0.82345340761905705,0.82131500365986299,0.81915274006795402,0.81690331761708901,0.81458822579565704,0.81219514784716695,0.80974499811132905,0.807235710336212,0.80465582731208596,0.80201455408594402,0.79930932765590301,0.79648750389748202,0.79362798326129402,0.79070036232099605,0.787638928999151,0.78440784361350002,0.78099485960718795,0.77744944962686402,0.77371150518720899,0.76973538558544097,0.76565053569238495,0.76144159894659003,0.75662810980856898,0.75119436702300502,0.74536901388311105,0.73879773166589402,0.73179268095953898,0.72457581093467205,0.71716875040925299,0.70934473058462399,0.70097829228392705,0.69167297599250499,0.68122016890261305,0.66930141445731295,0.65619604300413303,0.64109777124612,0.62254846107364303,0.60174682860740403,0.57684938052649104,0.547687976592933,0.51032035110738205,0.46446966087062502,0.41233558599887898,0.356003021779492,0.29917515399797801,0.24186399465018699,0.183876932061045,0.124793411976085,6.3700668562018503E-2,0]
[2.375,0.87417624996054999,0.87311221146876705,0.87199774486075798,0.87083115866692196,0.86960368037879199,0.86837466139262198,0.86714439588828396,0.865834336736927,0.86449126586562397,0.86314542656989601,0.86179741118523201,0.86044710536628399,0.85907206047770102,0.85767890004597003,0.85627226555394198,0.85480889502766999,0.85329906158171298,0.851777468341544,0.85021646778737503,0.84858733222648597,0.84695492491524604,0.84525187711044403,0.84347955306824396,0.84167202617998704,0.83985379998304099,0.837979425662148,0.83605326051625495,0.83407499822793996,0.832036587708886,0.82999311595720504,0.82793753572733897,0.82583844738488998,0.82371593749652805,0.821521114496085,0.81930341265907902,0.81703171828221899,0.81461462202062995,0.81212047457286796,0.80956343722561497,0.80694065476443599,0.80427336233992597,0.80156411295654795,0.79874505582220801,0.79588643472627396,0.79294563268262197,0.78987578751932197,0.78663234715519603,0.78328158186673702,0.77974152540498698,0.77601041129843296,0.77203455778091101,0.76795526117756197,0.76360304075650898,0.75869613314598705,0.753151615513034,0.74716259556591302,0.74048973166589505,0.733484680959538,0.72622351847145605,0.71878327942963105,0.71082523058462499,0.70239021282189196,0.69299485099250502,0.68250725721515604,0.67067887361187595,0.65771910911055798,0.64263525784784503,0.62399670099972004,0.60307067010343596,0.57801263052649099,0.54872638814513897,0.51091532593186095,0.46463690020633802,0.41238846099887899,0.356003021779492,0.29917515399797801,0.24186399465018699,0.183876932061045,0.124793411976085,6.3700668562018503E-2,0]
[2.4375,0.87685619517916702,0.87575877757252996,0.87458283486077104,0.87337660879680601,0.87214954838240499,0.87092053095511901,0.86969021439622696,0.868388207937833,0.86704301587494403,0.86569643195858703,0.86434788375861304,0.86296023577066605,0.86156865524875703,0.86013845477610296,0.85867002390692104,0.85719742265195298,0.85572269035980197,0.85419826033322499,0.85260766520504505,0.85097656359360496,0.84932638417895301,0.84764255779854103,0.84587476475858503,0.84406866306934203,0.84219452730906996,0.84028696238270295,0.838367956853314,0.83639528024704901,0.83437064325497801,0.83232661112387196,0.83026984856025798,0.82816951380481596,0.82602997706591996,0.823850373386803,0.82163454229836197,0.81936558410488503,0.81693462645316794,0.81439952920743597,0.81178865640147502,0.80916140476443399,0.80649411233992596,0.80378486295654805,0.800965805822207,0.79805164513276605,0.79506063268261995,0.79199078751931995,0.78878644476326398,0.78543650454929803,0.78188105442340095,0.77818762700272004,0.774229287002413,0.77016661780269002,0.76565078932233799,0.76066454417590201,0.75496238739466903,0.74878836683325101,0.74215359918817503,0.73517668095953903,0.72786264347145402,0.72031040527427803,0.71229617732752204,0.70373889021070701,0.694304572354558,0.68363148128749995,0.67203798899773903,0.65907423274760202,0.64410411845261595,0.62542432599971998,0.60429124428272396,0.57917588052649105,0.54965592172557798,0.51149695093186098,0.46479552520633799,0.412441335998879,0.356003021779492,0.29917515399797801,0.24186399465018699,0.183876932061045,0.124793411976085,6.3700668562018503E-2,0]
[2.5,0.87931255145826404,0.87815631309978004,0.87697048687672097,0.87576674311408897,0.874542165001018,0.87331568582872898,0.87208675646605105,0.87079687270630701,0.86945456814757904,0.86809868291980596,0.86671456477631703,0.86532597677881995,0.86387192798548895,0.86240812122200805,0.86094086046407903,0.85947132921834901,0.85800027229887899,0.85648491561385398,0.85489743450280498,0.85324899059532699,0.85157371695101802,0.84989434959173105,0.84818684961539503,0.84630714998734302,0.84440712748791702,0.84249696485332304,0.84054412592296801,0.83858682772899196,0.83662123760863705,0.83462141348635899,0.83257209455516101,0.83043752924533498,0.82828283032758698,0.82612275504073196,0.82389296217754804,0.821568798153817,0.81914800185214498,0.81660973629466704,0.81399409077425799,0.81136820727977899,0.80870228880632,0.80599442306416902,0.80313405543797101,0.80015853354338595,0.79712973627894201,0.79406419320139998,0.79087003829754299,0.78750618774112802,0.78398422536706003,0.78030262700271702,0.77639716200241105,0.77222510817978396,0.76765397624370602,0.76255112617300602,0.75667143472894605,0.75037461683325102,0.74375811348357601,0.73682224765276605,0.72947910004198002,0.72173803027427497,0.71370752927828796,0.70500919570645204,0.69550617745658605,0.68474185628749795,0.67334854688178303,0.66039610774760305,0.64549994962469603,0.62679170238224102,0.60550724359268504,0.58029822403647102,0.55053682148621297,0.51202879081276997,0.46495415020633801,0.41244793464913199,0.356003021779492,0.29917515399797801,0.24186399465018699,0.183876932061045,0.124793411976085,6.3700668562018503E-2,0]
[2.5625,0.88149915825193503,0.88034828282648203,0.87916781990222204,0.87796893040917101,0.87674780322165602,0.87552510635244796,0.874301227920109,0.87304166809368999,0.87169175109527397,0.87031103043445701,0.86890034446398401,0.86744276328876802,0.86598168847802404,0.86451844703344005,0.86305255376614298,0.86158384666571797,0.86011274568443497,0.85860548652354696,0.85699418630916002,0.85532122718826198,0.85364589615740005,0.85196709611885402,0.85019776511126699,0.84833508685369396,0.84642350223878005,0.844474984470723,0.84252365004904195,0.84056806666077799,0.83860882947521997,0.83664494370652798,0.834621096417828,0.83250248275581995,0.83037564833004796,0.82817660978916097,0.82591840315902798,0.823634091070514,0.82117390274449997,0.81866984663123099,0.81611222555796004,0.81349104272876904,0.81082940459478203,0.80809658854231203,0.80517306484135998,0.80217274754363099,0.79911433798159603,0.79605023247978501,0.79282742083531998,0.78944874237156104,0.78596299180256002,0.78232481330636205,0.77844309013005697,0.77415361130760996,0.76955553381637798,0.76433159445881804,0.75828449265310804,0.75196086683325103,0.74534436348357502,0.73841671501634298,0.73105975629533604,0.72316565527427501,0.71504223649281395,0.70622532070645205,0.69663718696343202,0.68585223128749795,0.67447206776468405,0.66169331098093898,0.64679063321965402,0.62801760371896398,0.60659849022583701,0.58135572403647096,0.55133272346106599,0.512499475046713,0.46511277520633798,0.41244793464913199,0.356003021779492,0.29917515399797801,0.24186399465018699,0.183876932061045,0.124793411976085,6.3700668562018503E-2,0]
[2.625,0.88342376252500998,0.88227766692259701,0.88110075054649095,0.87992055555006399,0.87871417534671303,0.87749556594294098,0.87627541376514095,0.87501947625677301,0.87373440247906298,0.87229772440452003,0.870844671181359,0.86938882343195401,0.86793098210462505,0.86647146334176595,0.86500685841470504,0.86353896468954305,0.86206979885044599,0.860540191634101,0.85890799107770699,0.857235975155199,0.85555123325933102,0.85377853487488797,0.85200399305279995,0.85017867956358295,0.848234346015728,0.84628544320303001,0.84433376631987,0.84237706470308904,0.84041617455134299,0.83845078265321604,0.83644928429245202,0.83436295553446704,0.83223189464069902,0.83000401755576403,0.82776994144722804,0.82548404593946201,0.82304610653570698,0.820551177880815,0.81805115402775597,0.81549639108821204,0.81282851762677599,0.81002716600579305,0.80708359267030105,0.80403114798401998,0.80097462119509999,0.79785973127909005,0.79458613522042598,0.79122564614263402,0.787743002340902,0.78419556556359804,0.78020672067411601,0.77592723692027898,0.77127526706600003,0.76602253243222995,0.75987074265310595,0.75354711683324904,0.74688202757842903,0.73994012787257701,0.73249580718951801,0.72459328027427305,0.71631123649281203,0.70741030714126296,0.697658883775511,0.68696260628749695,0.67552956776468398,0.66296231098093805,0.64800675821965203,0.62922673827276399,0.60763739456414501,0.582413224036471,0.55212584846106605,0.51292247504671296,0.465271400206338,0.41244793464913199,0.356003021779492,0.29917515399797801,0.24186399465018699,0.183876932061045,0.124793411976085,6.3700668562018503E-2,0]
[2.6875,0.88515411144271705,0.88400815809119604,0.88283242585703903,0.88165429863094003,0.88047465094057598,0.87928591613575202,0.87806771983867604,0.87679519976360798,0.87546090353564798,0.87409281903457203,0.87263997543055605,0.87118570949060803,0.86972924222318604,0.86827035363176497,0.86680902568345997,0.865346119090729,0.86384761496923701,0.86230942453291504,0.86068232485057095,0.85899394653265904,0.85723038356211201,0.85546491400070601,0.85369782132970895,0.85185582461289799,0.84996836376862495,0.84802301025585203,0.84607440511281495,0.84412020567774304,0.84216225535943501,0.84020104860639699,0.83820581616760503,0.83612596205487999,0.83399630582573403,0.83177252157161996,0.82952105122566699,0.82722645300089004,0.82484403858712496,0.82240180288081499,0.81990177902775696,0.817397988216361,0.81471165876212703,0.811885873055187,0.80889850851379996,0.80585381510335796,0.80277827817831304,0.79959439340327199,0.79631961934031603,0.79293185067670902,0.78948787734089998,0.78592202066558903,0.78189872067411503,0.77760014268783095,0.77288848292351398,0.76761079982440705,0.76145699265310596,0.75513336683324905,0.74841540257843098,0.74142062787257701,0.73386722062402598,0.72597805130564297,0.71753013962179002,0.70848725184338701,0.69866350877550798,0.68803156996084003,0.67655779622104195,0.66420982586972099,0.64919000497457102,0.63036090789353605,0.60858914456414503,0.58344307289065001,0.55289465341853306,0.51334547504671202,0.46543002520633697,0.41244793464913199,0.356003021779492,0.29917515399797801,0.24186399465018699,0.183876932061045,0.124793411976085,6.3700668562018503E-2,0]
[2.75,0.88668120419316498,0.88553674863951803,0.88436315138815802,0.88318679070190198,0.88200932470627802,0.88083063850508703,0.87960095865334498,0.87828497621449897,0.876953332593706,0.87562104595383095,0.87424573384703697,0.87279558722042305,0.87134123510241601,0.86988585150987796,0.86842868871844103,0.86693149184878604,0.86542377188707897,0.86389344975488402,0.86225133621222105,0.860529376141693,0.85876973148177205,0.85700863644077896,0.85524543789025398,0.85345767895496205,0.85160200114060003,0.849689277553897,0.847739753686788,0.84578518546653003,0.84382806858272497,0.84186792022008605,0.83985891104269295,0.83774250954774898,0.83562370848860901,0.83342844054106402,0.83113952560202098,0.82884604051705402,0.82649844672232597,0.82409962541154902,0.82166642992301597,0.81912669304465302,0.816456004653353,0.81365290888345099,0.81064858239376603,0.80760836214452503,0.804456188144694,0.80125401934685803,0.79793351043208305,0.79455798486342399,0.79117069598374201,0.78745417557074804,0.78353888269104599,0.77923926768783103,0.77444381932335404,0.76911125926165202,0.76304324265310397,0.75666885802976203,0.74994151737931203,0.74282686453521196,0.73518909562402801,0.72724829694388804,0.71874626462178903,0.70952576078193597,0.69966813377550796,0.68908906996083796,0.67756242122104204,0.66527720350237995,0.65034090628211805,0.63147128289353605,0.60954089456414495,0.58440083293631895,0.55363490341853305,0.51375624501428496,0.465588650206337,0.41244793464913199,0.356003021779492,0.29917515399797801,0.24186399465018699,0.183876932061045,0.124793411976085,6.3700668562018503E-2,0]
[2.8125,0.88816520172554903,0.88702024592147799,0.88584627457565701,0.88466966448814899,0.88348208652811699,0.88223103860545204,0.88097745744501199,0.87968879916097298,0.87838262445370396,0.87704944695458997,0.87571494798268101,0.87431579312834595,0.87287720216803599,0.87142095184838597,0.86992006678882905,0.86841461503628503,0.86690768473957602,0.86538070738397799,0.86373533379555401,0.86201337372502596,0.86025356071677705,0.85849179167040102,0.85672856107775297,0.85494373014415304,0.85313031070242595,0.85127189433024297,0.84933293707235902,0.84738209196652703,0.84542870107045498,0.84345279257557604,0.84141461974126297,0.83930166543611995,0.83717823054975604,0.83496673472588701,0.83272542688724105,0.83043229051705403,0.82808469672232698,0.82573027671773502,0.82327656949014305,0.82071294304465303,0.81805364650662604,0.81528982897399305,0.81234058239376905,0.80924091052980296,0.80604243814469401,0.80284026934685604,0.79951976043208295,0.796144234863425,0.79265137169774502,0.78889394665153201,0.78501820662580402,0.78083557548757698,0.77588690816230899,0.77059175926165202,0.76460206347904502,0.75820223302975998,0.75142201737931302,0.74414873953521199,0.73650067139623099,0.72842904183142698,0.71990357128998095,0.71050349527934398,0.70067275877550705,0.69009386243092297,0.67856608626855197,0.66628182850237905,0.65135753393344598,0.632501458348666,0.61049264456414398,0.58520822947584294,0.55434373056985997,0.51412637001428496,0.46574727520633702,0.41244793464913199,0.356003021779492,0.29917515399797801,0.24186399465018699,0.183876932061045,0.124793411976085,6.3700668562018503E-2,0]
[2.875,0.889571522059034,0.88844361044292597,0.88728974497929003,0.88607363174058096,0.88482200034053304,0.88356963268739797,0.882316425258036,0.88102765132300398,0.87973139361504604,0.87843449709707999,0.87710653692834595,0.87576293466083899,0.87434663218638298,0.87287277156514398,0.87136861478842198,0.86986253082076903,0.86835448009175298,0.86683128503051499,0.86518628517316898,0.86346433009494195,0.86170438516071202,0.85994298984541095,0.85818013298384199,0.85639655755968702,0.85458175377990497,0.85276497026373699,0.85089000511108903,0.84893939415763597,0.84696398393199301,0.84495723241170295,0.84292025060874298,0.84080626781204904,0.83863091657911604,0.83645128399204205,0.83423173537875495,0.83198624860216597,0.829644627675996,0.82726604535640802,0.82478738943013696,0.82222973565853796,0.81956219738460201,0.81679875358304599,0.81390068764850698,0.81078546078942404,0.80760535894697805,0.80440356388021805,0.80108342869652205,0.79767594774907902,0.79401159293463897,0.79026022216355596,0.78637199995236595,0.78227664829169696,0.77731453316230803,0.77203616686320897,0.76608256347904502,0.75973560802975704,0.75286965325309996,0.74547061453521202,0.737748771697471,0.72953941683142798,0.72092621759454101,0.71145524527934301,0.70166893293900101,0.69109848743092295,0.679517836268552,0.66728645350237803,0.65232535906591904,0.63343604535838505,0.61144439456414401,0.58600135447584301,0.55497823056986095,0.51449048038739997,0.46590590020633699,0.41244793464913199,0.356003021779492,0.29917515399797801,0.24186399465018699,0.183876932061045,0.124793411976085,6.3700668562018503E-2,0]
[2.9375,0.89090299893082003,0.88976591005035099,0.888565772676988,0.88735148566209698,0.88610245885809302,0.884850547129442,0.88359714666273803,0.88230855842950795,0.88101311314153197,0.87971702904354898,0.87841986025394903,0.877102752175977,0.87568711891694695,0.87422488035694601,0.87276000736869797,0.87125582937092505,0.869748812821591,0.86823019032085902,0.86658571212367297,0.86486458251131404,0.86310578219369505,0.86134559289954304,0.85958356854944795,0.85780047699167195,0.85598634919530803,0.85417079579231203,0.85235241743680101,0.85042604356270801,0.84842257230370699,0.84641607486307502,0.84437934713977203,0.842212743422734,0.84003764626945998,0.83785826776204297,0.83567575476141598,0.83344661553148103,0.83113731598111495,0.82868872499478696,0.82619793203040204,0.82364908453851304,0.82097812465297504,0.81826064499030504,0.81527326359576502,0.81221150094441297,0.80907229507253497,0.80589304179051702,0.80259545595196602,0.79906326074641199,0.79531663789949802,0.79151670331910795,0.78762033630380401,0.783515261773986,0.77870043891420604,0.77344606686289696,0.76754376489677401,0.76116938682092805,0.75421226692922905,0.74677822090124901,0.738898071220496,0.73063367304955495,0.721883005593974,0.71240345377064895,0.70262068293900104,0.69208119379325905,0.68044211769246798,0.66825107368613801,0.65321471877875403,0.63426264142324595,0.61239614456414304,0.58679447947584396,0.55555264724386899,0.51480773038740002,0.46606452520633701,0.41244793464913199,0.356003021779492,0.29917515399797801,0.24186399465018699,0.183876932061045,0.124793411976085,6.3700668562018503E-2,0]
[3,0.89214489927733798,0.89094286131524703,0.88973077146865298,0.88851648445376297,0.88730045556131598,0.88606682546736104,0.88481327166273704,0.88352468342950696,0.88222923814153198,0.88093315404354899,0.87963598525394804,0.878321500363477,0.87693962492751498,0.87549434958539296,0.87402900736869604,0.87256275049034904,0.87107068782158703,0.86955479338452002,0.86791021031117199,0.86618908069881395,0.86443028038119496,0.86266955249628496,0.86090669270556697,0.85912322638750405,0.85730909859114102,0.85549329066121804,0.85364797098469702,0.85177749774744604,0.84980066429707002,0.84779529991027602,0.84571333306758101,0.843541410620264,0.84136752344324095,0.83918936887481699,0.83700807981318304,0.83482227792266295,0.832445803662346,0.83001166178277797,0.82751492850442998,0.82494886258309397,0.82231925836144204,0.81954274578832098,0.81656463093404397,0.81350476946168904,0.81044205295707605,0.80729588832162003,0.80393443804981302,0.800276755752375,0.79655437864968703,0.79273282831910796,0.78875504862470303,0.78467851177398495,0.78002231391420296,0.77475794143506704,0.76891851489677399,0.76252405522473199,0.75548126692922701,0.74804505689692702,0.740008446220495,0.73167112458101402,0.722763849452006,0.71330232877064803,0.70357243293900096,0.69303294379325797,0.68134099269246795,0.66916057666098805,0.65406071877875405,0.63505177344419494,0.61327184939599,0.58758760447584302,0.55608139724386796,0.51512498038739996,0.46622315020633698,0.41244793464913099,0.356003021779492,0.29917515399797801,0.24186399465018699,0.183876932061045,0.124793411976085,6.3700668562018503E-2,0]
[3.0625,0.89330989806900396,0.89210786010691301,0.89089553356967799,0.88968021188936497,0.88846370556131504,0.88724648765155401,0.88602860012691598,0.88474080842950498,0.88344536314153099,0.88214927904354801,0.88085211025394805,0.87953906446063901,0.87815576296153797,0.87676334958539204,0.87529800736869601,0.873831750490348,0.872364634396954,0.87087929157201704,0.86923470849867102,0.86751357888631297,0.865754091395328,0.86399253940380505,0.86222944210139996,0.86044597578333604,0.85863142912882096,0.85678480248728806,0.85491697098469599,0.85304649774744501,0.85115980089071397,0.84913073111456705,0.84703520806758104,0.84486328562026303,0.84268939844323998,0.84051124387481702,0.83832995481318195,0.83609585628573702,0.83371480366234596,0.83128051350545995,0.82876821016526903,0.82621786258309504,0.82358667789747897,0.82075887078831999,0.81778510496200196,0.814773769461689,0.81171105295707802,0.80863288688406199,0.80515826904863697,0.80144000575237295,0.79771762864968698,0.79385422568795805,0.78984498888606902,0.78580093035658805,0.78123106058799896,0.77602694143506601,0.770212596068925,0.76379022484265302,0.75670592477614496,0.74919694860293595,0.74111882122049499,0.732675749581013,0.72360984945200602,0.71416709686088697,0.70450484234842603,0.69398345697847597,0.68223986769246703,0.67000657666098795,0.65490671877875395,0.63579202344419505,0.61406746317712402,0.58829084942116505,0.55661014724386804,0.5154422303874,0.466381775206337,0.41244793464913099,0.356003021779492,0.29917515399797801,0.24186399465018699,0.183876932061045,0.124793411976085,6.3700668562018503E-2,0]
[3.125,0.89446908167706896,0.89327207095135397,0.89205886500450704,0.89084346188936503,0.88962695556131399,0.88840973765155395,0.88719185012691604,0.88593892817367204,0.88466148814152901,0.88336540404354702,0.88206823525394695,0.88075518946063802,0.87937188796153798,0.87798762729884094,0.87656700736869597,0.87510075049034797,0.87363363439695396,0.87216289190865104,0.87055810446631898,0.86883720433232303,0.86707694105424804,0.86531528879963804,0.86355219149723295,0.86176821322786601,0.85992003931141803,0.85805380248728602,0.85618597098469496,0.85431549774744397,0.85241035196635995,0.85043540389507799,0.84835708306757995,0.84618516062026194,0.84401127344323901,0.84183311887481704,0.83961810321146901,0.83736485628573598,0.83498380366234604,0.83249663850545896,0.82998433516526904,0.82746907708173101,0.824758729423404,0.82195702256740799,0.81900122996200098,0.815992893268085,0.81298005295707998,0.80981257092676895,0.80630647310536196,0.80260325575237301,0.798873097392792,0.79493039304262003,0.79090248888606995,0.78686040329750695,0.78229922067273505,0.77728038034017599,0.77142739126502402,0.76498046098125505,0.75792204977614397,0.75030732360293495,0.74221514413175904,0.73365255921302197,0.72445584945200703,0.71501309686088599,0.705403717348425,0.694849720745494,0.68313874269246599,0.67085257666098796,0.65564967145824304,0.63653227344419405,0.61480771317712402,0.58891830742689599,0.557138897243867,0.51575948038740005,0.46654040020633702,0.41244793464913199,0.356003021779492,0.29917515399797801,0.24186399465018699,0.183876932061045,0.124793411976085,6.3700668562018503E-2,0]
[3.1875,0.89552749195942105,0.89440458637234399,0.89321720188795295,0.89200671188936398,0.89079020556131405,0.88957298765155302,0.88835510012691499,0.88710217817367198,0.88584239918713703,0.88458152904354503,0.88328436025394497,0.88197131446063803,0.88058801296153699,0.87920375229884096,0.87781817483933899,0.87636975049034704,0.87490263439695304,0.87343340556098703,0.87182867902386996,0.870146019772575,0.86839969045008003,0.86663803819547103,0.86487433584861395,0.86305392176699203,0.86118903931141699,0.85932280248728599,0.85745497098469403,0.85555931841748001,0.85362647696635896,0.85169070353097098,0.84966020322629299,0.84750703562026197,0.84533314844323804,0.84313583418289795,0.84088710321146898,0.83863385628573694,0.83622068557128704,0.83371276350545898,0.83120046016526805,0.82861246349488604,0.82590308887186403,0.82312027256740805,0.82021060002887303,0.81720901826808501,0.81416679904275302,0.81091067091694202,0.80736397310536201,0.80375317784174105,0.79998347239279,0.79598789304262096,0.79195998888607,0.78791161514920205,0.78330384567273503,0.77840214718617895,0.77258154029533199,0.76611668217963003,0.75909075948155902,0.75136493535942905,0.74324127445504395,0.73457891425027699,0.72530184945200704,0.715859096860887,0.70626743400616299,0.69561015368374601,0.68403761769246496,0.67169857666098898,0.65636823284807999,0.63727252344419505,0.61552441871033303,0.58949993242689602,0.55762995474753596,0.51607673038739899,0.46669902520633699,0.41244793464913099,0.356003021779492,0.29917515399797801,0.24186399465018699,0.183876932061045,0.124793411976085,6.3700668562018503E-2,0]
[3.25,0.89658499195942098,0.89546208637234403,0.89432757688795295,0.89313589120430603,0.89194311025164597,0.89073623765155296,0.88951835012691505,0.88826542817367105,0.88700564918713698,0.88574525183956998,0.884483774851202,0.88318743946063605,0.88180413796153601,0.88041987729883997,0.87903429983933901,0.87763875049034701,0.876171634396953,0.874702405560987,0.87309855341970399,0.87141589416840703,0.86969558618265097,0.86796008945369896,0.86615714274426603,0.86432292176699099,0.86245803931141696,0.86059180248728495,0.85870586053008602,0.85677544341747802,0.85484260196635897,0.85290682853097,0.85092920322629295,0.84880861439168498,0.84665040803825697,0.84440483418289802,0.84215610321146706,0.83989163619156304,0.83743681057128705,0.83492888850545899,0.83239203813089802,0.82972283849488504,0.82701346387186403,0.82426633042665798,0.82137385002887398,0.81842514326808402,0.81525874227996797,0.81191586960569095,0.80842090393479704,0.80480457797174698,0.80104010248160296,0.79704539304262001,0.79301748888607104,0.78891624014920303,0.78430847067273501,0.77938634771549797,0.77366330432070995,0.76722705717963002,0.76014139774433498,0.75240904189151203,0.74423768394911105,0.73542491425027701,0.72614784945200705,0.71670509686088402,0.70706055900616205,0.69635040368374701,0.68493649269246504,0.67250120313823902,0.65703046271681698,0.63801277344419505,0.61621179371033297,0.59008155742689705,0.55805295474753602,0.51629746003408405,0.46685765020633702,0.41244793464913099,0.356003021779492,0.29917515399797801,0.24186399465018699,0.183876932061045,0.124793411976085,6.3700668562018503E-2,0]
[3.3125,0.89761883392117903,0.89651958637234397,0.89538665590494304,0.89424626620430603,0.89305348525164496,0.89186000801783505,0.89066587429940602,0.88942867817367099,0.88816889918713604,0.88690850183957004,0.88564702485120095,0.88436969616661598,0.88302026296153502,0.88163600229883898,0.88025042483933802,0.87886395432730002,0.87744063439695197,0.87597140556098496,0.87436842781553603,0.87268575863616904,0.87096466934772898,0.869200248337754,0.86742614274426399,0.86559192176698996,0.86372703931141703,0.86184975771024397,0.85992198553008503,0.85799156841747803,0.85605872696635699,0.85412295353096901,0.85215702059091403,0.85007761439168505,0.84789757989189996,0.84567383418289899,0.84342510321146602,0.84110776119156105,0.83865293557128595,0.836145013505459,0.83350383390076099,0.83083321349488504,0.82812383887186303,0.82537670542665798,0.82252187085144302,0.81953240499156099,0.816302540355346,0.81292049460569205,0.80942552893479802,0.80580754703096902,0.80201507384606496,0.79808852995921198,0.79406687273814303,0.78992086514920301,0.78529811414872397,0.78029056720284695,0.77470647397074999,0.76833743217962902,0.76112880014751105,0.75341366689151101,0.74516276992571195,0.73627091425027602,0.72699384945200796,0.71755109686088503,0.707804982598917,0.69708889528108597,0.68578482124683404,0.67329432813823897,0.65765066351488899,0.63872044042484299,0.61687774506792104,0.59062072643707297,0.55847595474753597,0.51645608503408402,0.46701627520633698,0.41244793464913199,0.356003021779492,0.29917515399797801,0.24186399465018699,0.183876932061045,0.124793411976085,6.3700668562018503E-2,0]
[3.375,0.89857058392117894,0.89748990882068802,0.89639922177135001,0.89530427853936501,0.89416386025164496,0.89297038301783405,0.89177624929940602,0.89054709326941806,0.88931109371533901,0.88807175183956799,0.88681027485120201,0.88553294616661504,0.88418540154099001,0.88283692007991299,0.88146654983933703,0.88008007932730004,0.87869278910886395,0.87724040556098504,0.87563819919014596,0.87395475863616801,0.872188797956437,0.87041637333775201,0.86864251519051405,0.86684834793988397,0.86499206574411402,0.86306588271024298,0.86113811053008504,0.85920769341747705,0.857274851966357,0.85533907853096802,0.85337314559091404,0.85128789938115002,0.84911370489189897,0.846919478699519,0.84465093137067004,0.84232388619156096,0.83986906057128596,0.83728198451555103,0.83461420890076099,0.83194358849488503,0.82923421387186302,0.82648708042665797,0.82361568150157705,0.820533575150454,0.81727003033019097,0.81392511960569303,0.81040488518919296,0.80671373723747697,0.80296416323554798,0.79907641599922996,0.79505674420906702,0.79092549014920299,0.786249864148724,0.78118944220284603,0.77571109897074897,0.76935745240241904,0.76208055014750997,0.75433629786393697,0.746027378018154,0.73710046152444997,0.72783984945200797,0.71839709686088504,0.70852389359245105,0.69777627028108702,0.68657794624683299,0.67405369258728898,0.65823228851488902,0.63939554635665996,0.61749411897092799,0.59109660143707299,0.55889895474753604,0.51661471003408399,0.46713011624449102,0.41244793464913099,0.356003021779492,0.29917515399797801,0.24186399465018699,0.183876932061045,0.124793411976085,6.3700668562018503E-2,0]
[3.4375,0.89952233392117897,0.89844165882068705,0.89735097177135004,0.89625824782295604,0.89516453714471,0.89405702281635002,0.89288662429940402,0.89165746826941805,0.890421468715339,0.88918485856420304,0.88794717617845798,0.88669366375073699,0.88534865154098896,0.88400017007991305,0.882650497871317,0.88129620432729905,0.87990891410886396,0.878509405560985,0.87690719919014604,0.87517598560140297,0.87340492295643601,0.87163249833775103,0.86985864019051196,0.86806447293988098,0.86618287728731003,0.864282007710242,0.86235423553008494,0.86042381841747695,0.85849097696635501,0.85655520353096704,0.85456076650785395,0.85245114938114996,0.85032982989189698,0.84811333473169204,0.84584218372030795,0.84354001119155997,0.84105583998645495,0.83839235951555002,0.83572458390076099,0.83305396349488503,0.83034458887186202,0.82759745542665797,0.82463784682350605,0.82148532515045403,0.818221780330189,0.81490441985298601,0.81135663518919399,0.80761261223747804,0.80386303823554905,0.800016947654694,0.79600480661906603,0.79191134207457803,0.78716679016459201,0.78208831720284699,0.77664882475135899,0.77026876055691895,0.76302425278605501,0.75523108167160602,0.74680184855419696,0.73789358652445003,0.72868584945200798,0.71924309686088495,0.70921126859245098,0.69846364528108595,0.68737107124683405,0.67469288510986503,0.65881391351488805,0.64003004635665905,0.61807574397092702,0.591572476437073,0.55927862331480205,0.51677333503408496,0.46723586624449198,0.41244793464913099,0.356003021779492,0.29917515399797801,0.24186399465018699,0.183876932061045,0.124793411976085,6.3700668562018406E-2,0]
[3.5,0.900474083921179,0.89939340882068697,0.89830272177134995,0.89720999782295596,0.89611628714471003,0.89502195595300305,0.89390995269403395,0.89272335669819203,0.891520080834734,0.89029523356420304,0.88905755117845797,0.88780403875073699,0.88648032019137102,0.88515567072655998,0.88381374787131695,0.88246326329840596,0.88111196133327996,0.87973494886728298,0.87812552451190895,0.87639211060140298,0.87462104795643603,0.87284862333775104,0.87107476519051197,0.86923080082755999,0.86734612728730698,0.86546012845988896,0.86357036053008296,0.86163994341747596,0.85970710196635503,0.85775725668519998,0.85572401650785401,0.85361439938114902,0.85150147485920802,0.84927658473169099,0.84700543372030801,0.84472976076416295,0.84216621498645405,0.83950273451554802,0.83683495890076098,0.83416433849488503,0.83145496387186202,0.82867210785904299,0.82558959682350597,0.82243707515045394,0.81917353033019003,0.81582215598735697,0.81224454737281904,0.80851148723747901,0.80476191323554902,0.80086294765469301,0.79689913941239299,0.79281021707457699,0.78806566516459298,0.78298719220284696,0.77754602151778396,0.77116763555691903,0.76392196623809705,0.75605159327100702,0.74754209855419695,0.73868671152445098,0.72950721501175397,0.72003653807094503,0.70989864359245103,0.699151020281085,0.68809745896463403,0.67532738510986601,0.65939553851488797,0.64061995309597597,0.61865736897092805,0.59204835143707202,0.55964874831480205,0.51693196003408404,0.467341616244492,0.41244793464913199,0.356003021779492,0.29917515399797801,0.24186399465018699,0.183876932061045,0.124793411976085,6.3700668562018406E-2,0]
[3.5625,0.90142583392117903,0.900345158820688,0.89925447177134998,0.89816174782295499,0.89706803714470895,0.89597370595300296,0.89487879801105796,0.89372798169819201,0.89253457470938702,0.891340588459689,0.89014292084554303,0.88890923435667502,0.88759069519137102,0.88626604572655898,0.88494022014940399,0.88361359735223199,0.88227160836809904,0.88086826721923694,0.87932589120099103,0.877608235601403,0.87583717295643604,0.87406474833775005,0.87224814290111796,0.87039405082756005,0.86850937728730404,0.86662337845988702,0.86473583257275999,0.86284568796259298,0.86092322696635404,0.85892050668520004,0.85688726650785296,0.85477764938114698,0.85261184985920702,0.85042227253772096,0.84816868372030596,0.84580772671402005,0.84324873353527396,0.84061310951554802,0.83794533390075998,0.83527471349488502,0.83256333308649899,0.82965936282930597,0.826541346823505,0.82338882515045397,0.82012528033019005,0.816716974926749,0.81309054737281905,0.80941036223747898,0.80566078823554899,0.80170894765469403,0.797745139412393,0.79363816897761896,0.78893265392463896,0.78388606720284704,0.77835810132982697,0.77206651055691899,0.76472693502678102,0.75682554782961897,0.74828234855419695,0.73942967981497698,0.73030034001175403,0.72082966307094498,0.71058601859245096,0.69983839528108405,0.68873195896463402,0.67590971555972801,0.659977163514887,0.64117757306599998,0.61923899397092796,0.59252165119896905,0.56001765192237296,0.517090585034084,0.46744736624449201,0.41244793464913199,0.356003021779492,0.29917515399797801,0.24186399465018699,0.183876932061045,0.124793411976085,6.3700668562018406E-2,0]
[3.625,0.90237758392117895,0.90129690882068803,0.90020622177135001,0.89911349782295602,0.89801978714470898,0.89692545595300299,0.89583054801105799,0.89470077446497798,0.893539199709387,0.89234521345968898,0.89115019778622295,0.88993939360728702,0.88865842371732895,0.88735807167194902,0.88605059514940299,0.88471746774357796,0.88334005929341197,0.88196169859804197,0.88044236655251296,0.87881363306120297,0.87705329795643605,0.87524515856108098,0.87341139290111802,0.87155730082756,0.86967262728730399,0.86778662845988397,0.86589908257275805,0.86400893796259204,0.86206387172431898,0.86008375668519899,0.85805051650785202,0.85590754791772505,0.85372222485920501,0.85153264753771896,0.84929650735256201,0.84686522671401998,0.84430623353527401,0.84169416222536297,0.83905570890075798,0.83638508849488402,0.83362050811446897,0.830611112829306,0.82749309682350503,0.824340575150454,0.82103426373441202,0.81756297492674901,0.81393654737281795,0.81025660996998095,0.80651103279619596,0.80255494765469404,0.79854583908557497,0.79437841897761796,0.78974272843279203,0.784784942202848,0.77915122632982703,0.77293916143775998,0.76552006002678097,0.75752137947264697,0.74902259855419595,0.74016992981497598,0.73106481431483705,0.72154620713220596,0.71127339359245001,0.70052577028108398,0.68933136328580003,0.67642651659429298,0.66050688453682305,0.64167175030583701,0.61979094882381602,0.592944651198969,0.56033490192237201,0.51724921003408397,0.46754620664455798,0.41244793464913199,0.356003021779492,0.29917515399797801,0.24186399465018699,0.183876932061045,0.124793411976085,6.3700668562018406E-2,0]
[3.6875,0.90332933392117898,0.90224865882068706,0.90115797177135004,0.90006524782295605,0.89897153714470901,0.89787720595300302,0.89678229801105702,0.89565252446497801,0.89451598831517698,0.89334983845968896,0.89215482278622404,0.890944018607286,0.88966304871732904,0.88838120215795602,0.88708881359265002,0.88574351521621097,0.88438603047606501,0.88301919859804101,0.88150867085311102,0.87991874906214496,0.878213202872275,0.87640840856108104,0.87457464290111797,0.87272055082755895,0.87083587728730405,0.86894987845988403,0.867062332572755,0.86513407128434305,0.86317424672431897,0.86121151739160295,0.85920129582064697,0.85701792291772405,0.85483259985920401,0.85264302253771695,0.850309171530093,0.84792272671401803,0.84536373353527305,0.84275166222536302,0.84013531505678296,0.83747429949176999,0.83457318421565196,0.83156286282930603,0.82844484682350406,0.82529232515045303,0.82192347120447995,0.81840897492674902,0.81478254737281797,0.81110260996998196,0.80731734256007703,0.80340094765469505,0.79932955315847998,0.79511866897761796,0.79048297843279103,0.785633011741112,0.77994435132982698,0.77369073858401505,0.76628873953517496,0.75820875447264702,0.74973272065306895,0.74091017981497398,0.73180506431483705,0.72223358213220601,0.71196076859245006,0.70121314528108303,0.68986421413031696,0.676902391594293,0.66097344808030201,0.64214762530583602,0.62028948374091597,0.59336765119896895,0.56065215192237206,0.51740783503408405,0.46759908164455799,0.41244793464913099,0.356003021779492,0.29917515399797801,0.24186399465018699,0.183876932061045,0.124793411976085,6.3700668562018406E-2,0]
[3.75,0.90428108392118001,0.90320040882068797,0.90210972177134996,0.90101699782295597,0.89992328714471004,0.89882895595300305,0.89773404801105805,0.89660427446497704,0.89546773831517701,0.89433067571393499,0.89315944778622403,0.89194864360728698,0.89066767371732802,0.889373541868964,0.88804056359265005,0.88670684971466296,0.88537237016489001,0.88403222493330602,0.88254164205182895,0.880950031023645,0.87926726477381301,0.87751316510455801,0.875729702142646,0.87388380082756001,0.871999127287304,0.87011312845988298,0.86820185233132796,0.86624444628434005,0.86428462172431697,0.86232189239160195,0.86026363377423198,0.85812059592093104,0.85594297485920301,0.85366207507474101,0.85131379653009098,0.848961052269251,0.84642123353527099,0.84380916222536195,0.84119281505678301,0.83846752220098797,0.83552493421565199,0.83251461282930606,0.82939659682350397,0.82619256151809695,0.82276947120447996,0.81925497492674904,0.81562854737281798,0.81194860996998297,0.80811046756007698,0.80418637525799497,0.80006980315847998,0.79585891897761796,0.79122322843278903,0.78628253621607302,0.78072995733481498,0.77437811358401398,0.76702898953517495,0.75887006811303204,0.750420095653068,0.74165042981497298,0.73254531431483705,0.72292095713220705,0.71260898353663804,0.70189492242172102,0.69039296413031703,0.67737826659429201,0.66139644808030296,0.64258491414071295,0.62076535874091698,0.59379065119897001,0.56095588475646396,0.51756646003408302,0.467651956644558,0.41244793464913199,0.356003021779492,0.29917515399797801,0.24186399465018699,0.183876932061045,0.124793411976085,6.3700668562018406E-2,0]
[3.8125,0.90523283392118004,0.904152158820688,0.90306147177134999,0.901968747822956,0.90087503714470996,0.89978070595300397,0.89868579801105797,0.89755602446497695,0.89641948831517604,0.89528242571393502,0.89414437188985096,0.89295326860728597,0.89165712511223505,0.89032529186896303,0.88899231359264996,0.88765859971466299,0.88632412016489004,0.88498872839765597,0.88350655491419505,0.88189978053013496,0.88023443122990297,0.87855318444979402,0.87680078815778595,0.87501061877448205,0.87316237728730395,0.87126698749100595,0.86931222733132796,0.86735482128433905,0.86539499672431497,0.86338778870349198,0.86132113377423103,0.85917809592093097,0.85699163576756898,0.85466670007473999,0.85231842153008996,0.84996567726924999,0.84747873353527003,0.844866662225361,0.84221000793536505,0.83936639720098805,0.83644303800895403,0.83346636282930597,0.83034096055968898,0.82707615270909396,0.82361547120447898,0.82010097492675005,0.81647454737281799,0.81278956118154,0.80890359256007904,0.80492662525799497,0.80079644696833596,0.79659916897761796,0.79196161792752395,0.78691703621607401,0.78141733233481403,0.77505879339772399,0.767686559305226,0.75950456811303202,0.75110747065306904,0.74235042934970696,0.73327056577783001,0.72360833213220699,0.71324348353663802,0.70252942242172201,0.690921714130317,0.67784182071168697,0.66174808449635203,0.64300791414071301,0.621241233740916,0.59421365119896996,0.56122025975646395,0.51772508503408299,0.46770483164455801,0.41244793464913199,0.356003021779492,0.29917515399797801,0.24186399465018699,0.183876932061045,0.124793411976085,6.3700668562018406E-2,0]
[3.875,0.90618458392117796,0.90510390882068803,0.90401322177135102,0.90292049782295603,0.90182678714470998,0.900732455953004,0.899637548011059,0.89850777446497798,0.89737123831517696,0.89623417571393504,0.89509612188984999,0.89392424198091802,0.89260887511223397,0.89127704186896395,0.88994406359264899,0.88861034971466302,0.88727587016488996,0.88593284205526202,0.88440542991419302,0.88279865553013503,0.88115439748901703,0.879508954290253,0.87780792415055198,0.87603775504527304,0.87423707877799395,0.87236320420283398,0.87042260233132696,0.86846519628433905,0.86648173499227599,0.86444528870349002,0.86237863377423096,0.86023559592093002,0.85794338576756901,0.85563855457042903,0.85332304653008995,0.85097030226924897,0.84848990159188598,0.845917600007971,0.84314990222985997,0.84026527220098701,0.837341913008953,0.83438303946318204,0.83123983555968906,0.82792215270909397,0.82446147120447899,0.82094697492674995,0.81732054737281801,0.81358268618153895,0.80967572592162296,0.80561732363010097,0.80148382196833701,0.79733931743720798,0.79263532424754002,0.78755153621607399,0.782080807042,0.77563138446312596,0.76831421029707503,0.760139068113032,0.75179484565306698,0.74303780434970701,0.73395794077783105,0.72429570713220703,0.71387798353663801,0.70311771248883204,0.69141628256710097,0.67826482071168603,0.66206533449635296,0.64340518272185199,0.62168016669392001,0.59463665119897002,0.56148463475646404,0.51788371003408296,0.46775770664455801,0.41244793464913099,0.356003021779492,0.29917515399797801,0.24186399465018699,0.183876932061045,0.124793411976085,6.3700668562018406E-2,0]
[3.9375,0.90713633392117798,0.90605565882068595,0.90496497177135005,0.90387224782295705,0.90277853714471001,0.90168420595300403,0.90058929801105903,0.89945952446497801,0.89832298831517698,0.89718592571393496,0.89602692165255204,0.89482311698091699,0.89354917568044701,0.89222879186896398,0.89089581359265002,0.88956209971466205,0.88822698185168503,0.88683171705526198,0.88530430491419398,0.883697530530134,0.88205327248901699,0.88040782929025296,0.87876148674307397,0.87702706819418197,0.87519377198403603,0.87332461204595901,0.87145415278886396,0.86956397045759704,0.86753923499227603,0.86550278870348896,0.86343613377422801,0.86119570807805801,0.85889513576756804,0.85659030457042895,0.85428239672890904,0.85197006882332704,0.84949452659188496,0.84690047182581696,0.84404877722985905,0.84116414720098698,0.83824078800895196,0.83526577674788405,0.83208130673630298,0.82876815270909399,0.825307471204479,0.82179297492674896,0.81816654737281802,0.81437581118153901,0.81041597592162395,0.80630469863010101,0.80217119696833705,0.79802669243720803,0.79326982424754,0.78818603621607297,0.78270519392650095,0.77616013446312504,0.76881813962281798,0.76076664529476701,0.75247150446145705,0.74372517934970706,0.73459504719193203,0.72498308213220797,0.71451248353663899,0.70367896501489902,0.69184862107850897,0.67868782071168599,0.66238258449635201,0.64373106513425704,0.62210316669391996,0.59505965119896898,0.56174900975646402,0.51804233503408303,0.46781058164455802,0.41244793464913199,0.356003021779492,0.29917515399797801,0.24186399465018699,0.183876932061045,0.124793411976085,6.3700668562018406E-2,0]
[4,0.90804546264225705,0.90698308726913601,0.90591071383768196,0.90482399782295597,0.90373028714471004,0.90263595595300405,0.90154104801105905,0.90041127446497804,0.89927473831517801,0.89811383716053605,0.89692579665255301,0.89572199198091595,0.89444805068044697,0.89317327269447699,0.89184756359265005,0.89051384971466296,0.88912585685168499,0.88773059205526195,0.88620317991419395,0.88459640553013397,0.88295214748901596,0.88130670429025304,0.87966036174307505,0.87794521417259097,0.87610047051284301,0.87425451489073502,0.87240590278886399,0.87047720834753095,0.86852816229991003,0.86654185936399397,0.86444607605968105,0.86214745807805604,0.85984688576756796,0.85754205457042898,0.85523414672890996,0.85292181882332596,0.85045617699120502,0.84775595711446905,0.84494765222985802,0.84206302220098705,0.83913966300895204,0.83611177674788195,0.83287443173630304,0.82957630175100705,0.82615347120447902,0.82263897492674898,0.81901254737281903,0.815160847549251,0.81111949974350295,0.80699207363009995,0.80285857196833699,0.79871406743720696,0.79390432424753898,0.78882053621607295,0.78328681892650098,0.776661914587506,0.76924113962281804,0.76134127383957395,0.75309922368084803,0.74441255434970599,0.73522954719193201,0.72565559122391998,0.71514698353663997,0.70420771501489898,0.69227162107851004,0.67910446686682402,0.66269983449635195,0.64399544013425702,0.62252616669391903,0.59548265119896904,0.56201338475646301,0.518200960034083,0.46786345664455697,0.41244793464913199,0.356003021779492,0.29917515399797801,0.24186399465018699,0.183876932061045,0.124793411976085,6.3700668562018406E-2,0]
[4.0625,0.90890916047012404,0.90788196226913598,0.90680958883768203,0.90573519492001697,0.90465984754397499,0.90358388461899097,0.90249279801105897,0.90136302446497796,0.90019976144567804,0.89901271216053702,0.89782467165255297,0.89662086698091703,0.89534692568044605,0.89407214769447696,0.89279628553022605,0.89141908441914397,0.89002473185168496,0.88862946705526202,0.88710205491419403,0.88549528053013404,0.88385102248901504,0.88220557929025301,0.88053995599510104,0.87880710719079003,0.87699934551284198,0.87515338989073499,0.87327132143624697,0.87134912875358395,0.86942462499047102,0.86747208575768697,0.86532195413856905,0.86307108902421004,0.86079086103540703,0.85849380457042801,0.85618589672890999,0.85387356882332599,0.851330623292188,0.84857299813699205,0.845798924035149,0.84296189720098702,0.840013648842172,0.83693117597937805,0.833667556736302,0.830369426751007,0.82696028989002601,0.82348497492674899,0.81984419090106997,0.81590109754925,0.81180687474350299,0.80767944863010099,0.80354594696833603,0.79937149816264697,0.79453882424753797,0.78942012028541897,0.783838075001144,0.77713778958750501,0.76966413962281799,0.76187002383957403,0.75368084868084595,0.74505535480177998,0.73586404719193099,0.72623721622392101,0.71574171870681103,0.70473646501489995,0.69269462107851099,0.67947459186682402,0.66301086815244703,0.64425981513425701,0.622939044397127,0.59590565119896899,0.56227775975646299,0.51835958503408297,0.46791633164455798,0.41244793464913199,0.356003021779492,0.29917515399797801,0.24186399465018699,0.183876932061045,0.124793411976085,6.3700668562018406E-2,0]
[4.125,0.90975516047012495,0.90874758946368095,0.907708463837681,0.90663406992001705,0.90555872254397396,0.90448275961898905,0.90340622848327101,0.90226522627511496,0.90109710212517102,0.89991158716053699,0.89872354665255405,0.897519741980918,0.89624580068044701,0.89497102269447604,0.89365564325239299,0.89231795941914405,0.89092360685168503,0.88952834205526199,0.88800092991419399,0.88639415553013401,0.884749897489016,0.88309951098140604,0.88138595599510094,0.87965310719079104,0.87788977980391403,0.87603821547006699,0.87411732143624599,0.87219512875358396,0.87027062499047103,0.86823979256806605,0.86612705441901205,0.86391768300632299,0.861665490984038,0.85940528569949204,0.85711777977622206,0.85478053061714798,0.85212374829218696,0.849366123136991,0.84660462056587704,0.84383909041934302,0.84085964884217201,0.837724300979378,0.83446068173630195,0.83116255175100795,0.82775341489002696,0.82429050018749295,0.82063731590107003,0.81661744682090598,0.81249424974350304,0.80836682363010104,0.80423332196833597,0.80000599816264695,0.79517332424753795,0.790001745285418,0.78431395000114401,0.77757662018799101,0.77008713962281805,0.762398773839573,0.75421869094527805,0.74563697980178001,0.73649279984066196,0.72681884122391904,0.71632334370681106,0.70526521501489903,0.69311762107851005,0.67983017523162803,0.66327524315244701,0.64452419013425699,0.623309169397126,0.59630654021292095,0.56254213475646297,0.51851821003408305,0.46796920664455799,0.41244793464913199,0.356003021779492,0.29917515399797801,0.24186399465018699,0.183876932061045,0.124793411976085,6.3700668562018406E-2,0]
[4.1875,0.91060116047012596,0.90959358946368096,0.90857606446605599,0.90753294492001702,0.90645759754397404,0.90538163461898802,0.90427261188302599,0.90311122627511597,0.90194310212517104,0.90077446733695199,0.89960485167514104,0.89841861698091796,0.89714467568044698,0.89583737843432898,0.89450164325239201,0.89316520401524702,0.891822481851685,0.89042721705526195,0.88889980491419296,0.88729303053013397,0.88564877248901497,0.88394551098140495,0.88223195599510096,0.88049910719079005,0.87873577980391404,0.87688421547006701,0.874963321436246,0.87304112875358497,0.87106292969599597,0.86898004256806505,0.86686730441901105,0.86467826494647404,0.86248736379424995,0.86025548935339702,0.857985470816225,0.85556989459201604,0.85288496746001097,0.85014776621673105,0.84739774556587799,0.84459985366168,0.84166342136032501,0.83851742597937795,0.83525380673630101,0.83195567675100801,0.82854653989002702,0.82508362518749301,0.82134104289680998,0.81730482182090602,0.81318162474350297,0.80905419863010197,0.80492069696833601,0.80064049816264704,0.79580782424753804,0.79058337028541703,0.78477154370044699,0.77799962018798996,0.770510139622818,0.76288587663258001,0.75474744094527801,0.74617077281576905,0.73707442484065999,0.72739543892709502,0.71690496870681197,0.70578248331813298,0.69354062107851,0.68013744359067596,0.66350560739183495,0.64478856513425697,0.62367929439712699,0.59667666521292095,0.56280650975646196,0.51867683503408202,0.468022081644558,0.41244793464913199,0.356003021779492,0.29917515399797801,0.24186399465018699,0.183876932061045,0.124793411976085,6.3700668562018406E-2,0]
[4.25,0.91144716047012697,0.91043958946368198,0.909422064466056,0.90840257227228505,0.907356472543975,0.90624514136078105,0.905118611883025,0.90395722627511499,0.90278910212517105,0.901620467336952,0.90045085167514105,0.89926547671446,0.89798456480914501,0.89666822273701396,0.89534764325239202,0.89401120401524703,0.89267402848029498,0.89132609205526203,0.88979867991419304,0.88819190553013305,0.88650416661929599,0.88479151098140496,0.88307795599509897,0.88134510719078996,0.87958177980391405,0.87773021547006702,0.87580932143624601,0.87387722644777199,0.87180317969599597,0.86972029256806604,0.86760755441901205,0.86541851494647304,0.86322761379424995,0.86103299734986305,0.85876182668183199,0.85626556716563595,0.85360918701483901,0.85088801621673105,0.84814696051216398,0.84531665095182895,0.84235209706993097,0.83928942757708902,0.83604693173630096,0.83274880175100796,0.82933966489002797,0.82587675018749296,0.822017342618238,0.817949764057321,0.81386899974350302,0.80974157363010102,0.80556187301091398,0.80127499816264702,0.79639683181360099,0.79114308078149398,0.78519454370044695,0.77842262018799002,0.77093313962281695,0.76332615998763198,0.75526750199756998,0.746659253150322,0.73765604984066002,0.72792418892709398,0.71748239108918799,0.70625835831813299,0.69396362107851095,0.68040181859067494,0.66371710739183598,0.64505294013425696,0.62404941939712599,0.59704679021291995,0.56307088475646205,0.51883546003408199,0.468074956644558,0.41244793464913199,0.356003021779492,0.29917515399797801,0.24186399465018699,0.183876932061045,0.124793411976085,6.3700668562018406E-2,0]
[4.3125,0.91229316047012698,0.91128558946368299,0.91026806446605801,0.90924857227228495,0.90819036309461898,0.90709114136078195,0.90596461188302602,0.904803226275114,0.90363510212517095,0.90246646733695302,0.90129685167514195,0.90009326206472995,0.89877768980914496,0.89746134773701502,0.89614404928899805,0.89482604965566004,0.89350731484190904,0.89218196833596197,0.890697554914193,0.889061637099541,0.887350166619295,0.88563751098140497,0.88392395599509999,0.88219110719078997,0.88042777980391396,0.87857621547006703,0.87665532143624503,0.87462350180236603,0.87254342969599596,0.87046054256806704,0.86834780441901205,0.86615876494647404,0.86396786379424995,0.86174317804866296,0.85941555029387995,0.85691147232639497,0.85427987722475096,0.85158802928134802,0.84883323906820995,0.84596600401213196,0.84298659706992995,0.839971741730138,0.83679294030812101,0.83354192675100702,0.83013278989002803,0.82663445980141403,0.82265184261823898,0.81858426405732199,0.81451319154032198,0.81042894863010295,0.80619637301091396,0.80190949816264701,0.79697845681360102,0.79167183078149395,0.78561754370044801,0.77884562018798997,0.77135613962281602,0.76374915998763104,0.75574337699756899,0.74713512815032102,0.73823767484066005,0.72845293892709395,0.71801114108918795,0.70673124914864704,0.69438322484530801,0.68066619359067404,0.66392860739183601,0.64531731513425705,0.62441954439712599,0.59741691521292095,0.56333525975646204,0.51899408503408195,0.46812783164455801,0.41244793464913199,0.356003021779492,0.29917515399797801,0.24186399465018699,0.183876932061045,0.124793411976085,6.3700668562018406E-2,0]
[4.375,0.913139160470126,0.912131589463683,0.91111406446605803,0.91005345069815302,0.90898348809462004,0.90791305747511497,0.90681061188302603,0.90564922627511502,0.90448110212516997,0.90331246733695403,0.90213182728528696,0.90088638706473101,0.89957081480914602,0.89825447273701498,0.896937174288998,0.89561917465566099,0.89430043984190899,0.89298082236899701,0.89154299245147495,0.88990763709954102,0.88819616661929501,0.88648351098140599,0.8847699559951,0.88303710719078998,0.88127377980391297,0.87942221547006705,0.87744149509581304,0.87536375180236503,0.87328367969599596,0.87120079256806704,0.86908805441901305,0.86689901494647403,0.86470811379425006,0.86243055304866301,0.86005005029387904,0.85754597232639596,0.85491437722475205,0.85223067621627002,0.84944789153086897,0.84656476082826804,0.84361410877488097,0.84060624173013798,0.83748031530812195,0.83424451868264504,0.83089778940673897,0.82731576086443404,0.82328634261823896,0.81921876405732197,0.81514769154032296,0.811063088712489,0.80683087301091305,0.80254074790363805,0.79756008181360105,0.79219098113881603,0.78604054370044696,0.77926862018799004,0.77177913962281597,0.76417215998763099,0.75621925199756901,0.74761100315032103,0.73878759287128404,0.72898168892709403,0.71853989108918803,0.707154249148646,0.69475325543148003,0.68093056859067402,0.66414010739183504,0.64558169013425704,0.62475774224666003,0.59778704021291995,0.56359963475646202,0.51915271003408103,0.46818070664455802,0.41244793464913199,0.356003021779492,0.29917515399797801,0.24186399465018699,0.183876932061045,0.124793411976085,6.3700668562018406E-2,0]
[4.4375,0.91398516047012601,0.91297758946368301,0.91191606623396104,0.91084657569815297,0.90977661309461999,0.90870618247511503,0.90763520837463996,0.90649522627511503,0.90532710212516998,0.90415463744582303,0.90292495228528802,0.90167951206473196,0.90036393980914697,0.89904759773701504,0.89773029928899895,0.89641229965566205,0.89509356484190905,0.89377394736899696,0.89233611745147501,0.89071938472928602,0.88904216661929603,0.887329510981405,0.88561595599510001,0.883883107190791,0.88211977980391298,0.88025147657434699,0.87818174509581304,0.87610400180236403,0.87402392969599696,0.87194104256806704,0.86982830441901304,0.86763926494647403,0.86539922758365495,0.863069973568108,0.86068455029387803,0.85818047232639605,0.85554887722475204,0.85281398691068599,0.849985767797103,0.84709859020825395,0.84417296219334503,0.84120981396680095,0.83811835437953897,0.83493189368264598,0.83158516440673902,0.82788668394055398,0.82388250788226103,0.81983556125092205,0.81578219154032405,0.81164471371248903,0.80742145500960205,0.80312237290363797,0.79812031772412995,0.79266685613881604,0.78643646019734104,0.77965909912472597,0.77220213962281603,0.76459515998763095,0.75664781896885402,0.74808687815031905,0.73931061636375695,0.729510438927094,0.71903919799527005,0.70753860246346301,0.69507050543147897,0.68119494359067401,0.66435160739183496,0.64584606513425802,0.62507499224666097,0.59815716521291995,0.563864009756462,0.519311335034081,0.46823358164455797,0.41244793464913199,0.356003021779492,0.29917515399797801,0.24186399465018699,0.183876932061045,0.124793411976085,6.3700668562018406E-2,0]
[4.5,0.91483116047012603,0.913778158785161,0.91270919123396099,0.91163970069815303,0.91056973809462005,0.90949930747511498,0.90842833337464002,0.90732251255629603,0.90617310212517099,0.90494776244582298,0.90371807728528697,0.90247263706473302,0.90115706480914803,0.89984072273701599,0.89852342428899901,0.897205424655663,0.89588668984191,0.89456707236899802,0.89312924245147396,0.89151250972928597,0.88985833730737995,0.88817551098140501,0.88646195599510103,0.88472910719079101,0.882965779803914,0.88099842396879102,0.87892199509581403,0.87684425180236503,0.87476417969599596,0.87268129256806604,0.87056855441901404,0.86836421143568698,0.86607728278816098,0.86370447356810898,0.86131905029387801,0.85881497232639503,0.85617628048243299,0.85339561191068702,0.85051451779710396,0.84762734020825403,0.844701712193345,0.84174084686055595,0.83871032720232097,0.83559574637423795,0.83227253940673795,0.82841543394055495,0.82444074160452896,0.82041718625092197,0.81636678674431695,0.81219716476081805,0.80799466158563804,0.80365994957634501,0.79864906772413102,0.79314273113881595,0.78680658519734004,0.78002922412472597,0.77262513962281498,0.76498648002480196,0.75707081896885398,0.74856275315031895,0.73978649136375796,0.73003918892709496,0.71951507299526996,0.70790872746346301,0.69538775543147902,0.68145931859067399,0.66456310739183599,0.646110440134258,0.62539224224666101,0.59852729021291895,0.56412838475646199,0.51946996003408097,0.46828645664455798,0.41244793464913199,0.356003021779492,0.29917515399797801,0.24186399465018699,0.183876932061045,0.124793411976085,6.3700668562018406E-2,0]
[4.5625,0.91563056536592402,0.91457128378516095,0.91350231623396105,0.91243282569815298,0.91136286309462,0.91029243247511504,0.90922145837463997,0.90811563755629598,0.90695357539614796,0.90574088744582304,0.90451120228528603,0.90326576206473097,0.90195018980914798,0.90063384773701705,0.89931654928899996,0.89799854965566295,0.89667981484191095,0.89536019736899897,0.89392236745147602,0.89230563472928603,0.89065146230738101,0.88899616067131804,0.88730795599510004,0.88557510719079202,0.88376518511323998,0.88173867396879102,0.87966224509581403,0.87758450180236502,0.87550442969599596,0.87342154256806703,0.87130880441901304,0.86905158643568803,0.86671178278816097,0.86433897356810996,0.86195355029387799,0.85944947232639402,0.85675790548243402,0.85392846947755296,0.85104326779710504,0.848156090208254,0.84523046219334497,0.84226959686055702,0.83923907720232105,0.83617737137423898,0.83283901914620095,0.82894127815890795,0.82496949160452904,0.82096498178696797,0.81692253906699897,0.81272591476081901,0.80852341158563901,0.80418869957634598,0.79913287179092796,0.79357395103262995,0.78717671019734003,0.78039934912472597,0.77304813962281604,0.76535660502480196,0.75744244619850898,0.74903862815031896,0.74026236636375697,0.73055281063155897,0.71999094799526997,0.708278852463463,0.69570500543147895,0.68167621620511598,0.66477460739183603,0.64637481513425799,0.62570949224666095,0.59889741521291895,0.56439275975646197,0.51962858503408005,0.46833933164455799,0.41244793464913199,0.356003021779492,0.29917515399797801,0.24186399465018699,0.183876932061045,0.124793411976085,6.3700668562018406E-2,0]
[4.625,0.91642369036592497,0.91536440878516101,0.914295441233961,0.91322595069815304,0.91215598809461995,0.91108555747511499,0.91001458337464003,0.90886644666261895,0.90769382539614896,0.90652071412920998,0.90530432728528598,0.90405888706473003,0.90274331480914705,0.901426972737017,0.90010967428900002,0.89879167465566401,0.89747293984191201,0.89615332236900003,0.89471549245147597,0.89309875972928698,0.89144458730738196,0.88978928567131799,0.88813310766759901,0.886397531705162,0.88455406180915996,0.88247892396879202,0.88040249509581403,0.87832475180236502,0.87624467969599595,0.87416179256806703,0.87201470860803498,0.86971538624528,0.86734628278816195,0.86497347356811005,0.86258805029387897,0.86006808801293799,0.85733953048243405,0.85445721947755404,0.85157201779710501,0.84868484020825496,0.84575921219334504,0.84279834686055699,0.83976782720232201,0.83673471649335096,0.83326513272851499,0.82941715315890796,0.82546768692378303,0.82148844062696402,0.81740709011430501,0.81325354221787005,0.80905216158563997,0.80471744957634594,0.79955587179092802,0.79395312563797404,0.78754683519733903,0.78076947412472697,0.773471139622816,0.76572673002480196,0.75781257119850798,0.74951450315031798,0.74073824136375699,0.73102868563155898,0.72046682299527098,0.70864855216517797,0.696022255431479,0.68188771620511601,0.66498610739183595,0.64663919013425797,0.62602674224666099,0.59926754021291795,0.56465713475646295,0.51978721003408102,0.468392206644558,0.41244793464913199,0.356003021779492,0.29917515399797801,0.24186399465018699,0.183876932061045,0.124793411976085,6.3700668562018406E-2,0]
[4.6875,0.91721681536592503,0.91615753378516096,0.91508856623396095,0.91401907569815199,0.91294911309462001,0.91187868247511505,0.91077258697968999,0.90960669666261895,0.90843407539614796,0.90726096412920998,0.90608689286871402,0.90485201206473098,0.903536439809145,0.90222009773701595,0.90090279928899997,0.89958479965566396,0.89826606484191196,0.89694644736899898,0.89550861745147703,0.89389188472928705,0.89223771230738103,0.89058241067131805,0.88892567638701703,0.88717434983985399,0.88529431180916096,0.88321917396879202,0.88114274509581403,0.87906500180236602,0.87698492969599595,0.87490153820234196,0.87270208360803503,0.87034988624527898,0.86798078278816204,0.86560797356811003,0.86322255029387895,0.86064971301293902,0.85786930138543205,0.85498596947755401,0.85210076779710497,0.84921359020825504,0.84628796219334501,0.84332709686055696,0.84029657720232098,0.83723799256410003,0.83368813272851505,0.82986956959176195,0.82594356192378404,0.82196431562696404,0.81785011866186497,0.81372194853648305,0.809570206421659,0.80519806868066901,0.79997887179092797,0.79432325063797404,0.787873484406998,0.78113959912472597,0.77389308374980403,0.76609685502480196,0.75818269619850798,0.749938761150585,0.741214116363757,0.73148090561095203,0.720942697995271,0.70896580216517802,0.69633950543147904,0.68206495351885399,0.66519760739183598,0.64690356513425895,0.62634399224666104,0.59963244638802604,0.56492150975646305,0.51994583503408098,0.468445081644558,0.41244793464913199,0.356003021779492,0.29917515399797801,0.24186399465018699,0.183876932061045,0.124793411976085,6.3700668562018406E-2,0]
[4.75,0.917972410600707,0.91693192400491097,0.91588169123396102,0.91481220069815306,0.91374223809461996,0.91264388057889001,0.91151283697968999,0.91034694666261895,0.90917432539614895,0.90800121412920998,0.90682714286871302,0.90563733900737198,0.90432956480914495,0.90301322273701401,0.90169592428900003,0.90037792465566402,0.89905918984191202,0.89773957236900004,0.89630174245147598,0.894685009729287,0.89303083730738197,0.891375535671318,0.88966592638701703,0.88791459983985399,0.88602283832483197,0.88395942396879301,0.88188299509581503,0.87980525180236602,0.87772517969599595,0.875588913202342,0.87335162689494505,0.87098438624527996,0.86861528278816302,0.86624247356811002,0.86383235099225997,0.86122930002503795,0.85839805138543002,0.85551471947755398,0.85262951779710505,0.84974234020825501,0.84681671219334598,0.84385584686055704,0.84082532720232095,0.83771386756410005,0.83407970388960595,0.83029256959176201,0.82641943692378395,0.82239800245441996,0.81827311866186603,0.814144948536484,0.810011239151188,0.80564449961659101,0.80040187179092803,0.79467625303127498,0.78819073440699805,0.78150520190456396,0.77426320874980303,0.76646698002480196,0.75855282119850798,0.75036176115058495,0.74167044685783401,0.73190390561094998,0.72141857299527101,0.70928305216517795,0.69665675543147798,0.68222357851885396,0.66540910739183601,0.64716794013426004,0.62666124224666098,0.59992000002118795,0.56518588475646303,0.52010446003408095,0.46849795664455801,0.41244793464913199,0.356003021779492,0.29917515399797801,0.24186399465018699,0.183876932061045,0.124793411976085,6.3700668562018406E-2,0]
[4.8125,0.918712660600706,0.91767217400491097,0.91662202935816195,0.91557138723533305,0.91451462163477903,0.91338413057889001,0.91225308697968899,0.91108719666261895,0.90991457539614895,0.90874146412920997,0.90756739286871402,0.90637758900737198,0.90511766534105398,0.90380634773701396,0.90248904928899798,0.90117104965566397,0.89985231484191197,0.89853269736899999,0.89709486745147704,0.89547813472928794,0.89382396230738204,0.89213824859578195,0.89040617638701702,0.88865484983985399,0.88671021332483202,0.88469257419372305,0.88262324509581502,0.88054550180236701,0.87844593978486996,0.87627628820234305,0.87398612689494404,0.87161888624527994,0.86924978278816301,0.86687697356811,0.86441397599226,0.86175805002503902,0.85892680138542898,0.85604346947755505,0.85315826779710602,0.85027109020825598,0.84734546219334494,0.844384596860556,0.84134142872284401,0.83811609049330305,0.83444982888960595,0.83071556959175996,0.82684533447242303,0.82282100245442003,0.81869611866186598,0.81456794853648495,0.81043423915118895,0.80600885929563304,0.80079527888998203,0.79499350303127503,0.78850798440699899,0.78182245190456401,0.77463333374980203,0.76683710502480196,0.75892294619850797,0.75077101241201505,0.74209344685783196,0.73232690561094904,0.72184401898964601,0.709600302165178,0.696927646700087,0.68238220351885404,0.66562060739183604,0.64741435884895904,0.62697849224666102,0.60018437502118904,0.56545025975646301,0.52024549773581497,0.46855083164455802,0.41244793464913199,0.356003021779492,0.29917515399797801,0.24186399465018699,0.183876932061045,0.124793411976085,6.3700668562018406E-2,0]
[4.875,0.919452910600706,0.91841242400491097,0.91736227935816295,0.91631163723533504,0.91525487163477903,0.91412438057889001,0.91299333697968998,0.91182744666261895,0.91065482539614895,0.90948171412920997,0.90830764286871402,0.90711783900737197,0.90585791534105398,0.904597241745278,0.90328217428899804,0.90196417465566203,0.90064543984191203,0.89932582236900005,0.89788799245147699,0.89627125972928801,0.89460969443689198,0.89287849859578206,0.89114642638701702,0.88939509983985399,0.88739758832483195,0.88537994919372198,0.88336104222580303,0.88128575180236701,0.879133314784871,0.87691157155520205,0.87462062689494502,0.87225338624528104,0.86988428278816299,0.86748043077911097,0.86499050411346101,0.86228680002503899,0.85945555138542895,0.85657221947755302,0.85368701779710598,0.85079984020825605,0.84787421219334502,0.84491334686055697,0.84181730372284402,0.83848621549330304,0.83481995388960595,0.83110010006419999,0.82726268171347594,0.82322049300547195,0.81911911866186604,0.81499094853648502,0.81085723915119001,0.80632610929563298,0.80116540388998203,0.79531075303127496,0.78882523440699903,0.78213970190456406,0.77500345874980303,0.76720723002480196,0.75929307119850797,0.75114113741201505,0.74251389758403996,0.73274990561094699,0.72225253988641502,0.70991755216517805,0.69719202170008598,0.682540828518854,0.66583210739183596,0.64762585884895796,0.62728113293001697,0.60044875002118903,0.565714634756463,0.52029998991189597,0.46856792303339601,0.41244793464913199,0.356003021779492,0.29917515399797801,0.24186399465018699,0.183876932061045,0.124793411976085,6.3700668562018406E-2,0]
[4.9375,0.92019316060070699,0.91915267400491196,0.91810252935816306,0.91705188723533504,0.91599512163477903,0.91486463057889,0.91373358697968898,0.91256769666261905,0.91139507539614895,0.91022196412921097,0.90904789286871401,0.90785808900737197,0.90659816534105397,0.905337491745278,0.90407529928899799,0.90275729965566198,0.90143856484191098,0.900118947369,0.89868111745147705,0.89706438472928796,0.89534994443689297,0.89361874859578205,0.89188667638701702,0.89010143657784402,0.888084963324832,0.88606732419372203,0.88404841722580296,0.88198752634583599,0.87980721091365399,0.87754607155520303,0.875255126894945,0.87288788624528002,0.87051878278816397,0.868062055779111,0.86551925411346098,0.86281555002503896,0.85998430138542903,0.85710096947755199,0.85421576779710595,0.85132859020825602,0.84840296219334599,0.84544209686055705,0.84229317872284404,0.83885634049330304,0.83519007888960595,0.83147022506419999,0.82763280671347605,0.82359061800547295,0.81954211866186699,0.81541394853648497,0.81128023915118996,0.80664335929563302,0.80151466711521502,0.79562800303127601,0.78914248440699897,0.78245695190456399,0.77537358374980203,0.76757735502480195,0.75966319619850797,0.75151126241201505,0.74288402258403896,0.73317290561094695,0.72254754073861505,0.71023480216517798,0.69745639670008497,0.68269945351885497,0.66604360739183599,0.64783735884895799,0.62754550793001695,0.60071312502118901,0.56597900975646298,0.52035286491189603,0.46856792303339601,0.41244793464913199,0.356003021779492,0.29917515399797801,0.24186399465018699,0.183876932061045,0.124793411976085,6.3700668562018406E-2,0]
[5,0.92093341060070699,0.91989292400491196,0.91884277935816305,0.91779213723533504,0.91673537163478003,0.915604880578891,0.91447383697968998,0.91330794666261905,0.91213532539614905,0.91096221412920997,0.90978814286871401,0.90859833900737197,0.90733841534105397,0.906077741745278,0.90481613382117698,0.90355042465566204,0.90223168984191005,0.90091207236899895,0.899474242451477,0.89782026106384405,0.89609019443689297,0.89435899859578305,0.89262692638701802,0.89078881157784295,0.88877233832483205,0.88675469919372196,0.88473121617566597,0.88262430362085098,0.88044171091365397,0.87818057155520202,0.87588962689494498,0.87352238624528,0.87111715522323796,0.86863568061962204,0.86604800411346095,0.86334430002503804,0.860513051385429,0.85762971947754996,0.85474451779710603,0.85185734020825599,0.84893171219334695,0.84591814883085303,0.84276905372284405,0.83922646549330204,0.83556020388960595,0.83184035006419998,0.82795746254235203,0.82396074300547295,0.81991531039864296,0.81583694853648403,0.81170323915119102,0.80696060929563196,0.80183191711521595,0.79594525303127595,0.78945973440699901,0.78277420190456404,0.775702695995791,0.76794748002480195,0.76003332119850697,0.75188138741201505,0.74325414758403896,0.73359590561094801,0.72276162882859396,0.71052231456918602,0.69768054063129303,0.68285807851885505,0.66625510739183502,0.64804885884895902,0.62780988293001705,0.60097750002118899,0.56624338475646196,0.52040573991189598,0.46856792303339601,0.41244793464913199,0.356003021779492,0.29917515399797801,0.24186399465018699,0.183876932061045,0.124793411976085,6.3700668562018406E-2,0]

{"sheet":"Eigenverbrauch","index":6,"n_rows":82,"n_cols":82,"rows_kept":82,"cut":false,"hidden":true,"merged":[]}
[null,5,4.9375,4.875,4.8125,4.75,4.6875,4.625,4.5625,4.5,4.4375,4.375,4.3125,4.25,4.1875,4.125,4.0625,4,3.9375,3.875,3.8125,3.75,3.6875,3.625,3.5625,3.5,3.4375,3.375,3.3125,3.25,3.1875,3.125,3.0625,3,2.9375,2.875,2.8125,2.75,2.6875,2.625,2.5625,2.5,2.4375,2.375,2.3125,2.25,2.1875,2.125,2.0625,2,1.9375,1.875,1.8125,1.75,1.6875,1.625,1.5625,1.5,1.4375,1.375,1.3125,1.25,1.1875,1.125,1.0625,1,0.9375,0.875,0.8125,0.75,0.6875,0.625,0.5625,0.5,0.4375,0.375,0.3125,0.25,0.1875,0.125,6.25E-2,0]
[0,8.0089596647485203E-2,8.0991206608370503E-2,8.1913626504078296E-2,8.2857823009198805E-2,8.3824271304887399E-2,8.4813795784469501E-2,8.5827453633295303E-2,8.6866440279120105E-2,8.7931544941211304E-2,8.9023875579845799E-2,9.0144057104112996E-2,9.1293123613016794E-2,9.2472008375754505E-2,9.3682521014845602E-2,9.4925891056084399E-2,9.6203163471172401E-2,9.7516016834166303E-2,9.8865864872265299E-2,0.10025429117067999,0.101683301386977,0.10315504769541201,0.10467136136741099,0.106234597312867,0.10784673227276199,0.109510359682226,0.11122788867128799,0.113001326025525,0.114833501992594,0.116727213042599,0.118686016042667,0.120713214952166,0.122812722513336,0.12498761113743199,0.12724191105593899,0.129580307338579,0.13200913993952801,0.13453369452021599,0.13715820708069801,0.139889263100826,0.14273402134139301,0.145699751146389,0.14879476531884001,0.15202704207289899,0.15540761145745899,0.158945916627899,0.16265547543290401,0.16654772284866501,0.170640714786917,0.17494399699213301,0.179475560697645,0.18425654109134201,0.18930832311802501,0.19465464015821499,0.200318164187821,0.206330393329242,0.212728875029075,0.21955783690438599,0.22686424227594201,0.23470109890131699,0.24312651946924799,0.25221248678212899,0.262037111223765,0.272698587396763,0.28429143449537297,0.29694522398036499,0.31085152674495498,0.32621279966552003,0.34324181743794102,0.36223339376711,0.38348246489825299,0.40723463378044,0.43359231038004697,0.46320179596962802,0.49722091214973801,0.53731824293682895,0.58601309544646896,0.64731648878280701,0.72759905480352505,0.83489948864837504,0.96158908287570899,1]
[6.25E-2,8.5901750083014594E-2,8.6891991989005102E-2,8.7905029715468597E-2,8.8941916162049106E-2,9.0003958835279105E-2,9.1091389188495603E-2,9.2205179250324801E-2,9.3345453571272496E-2,9.4514578004595506E-2,9.5713192383504203E-2,9.6943455145617294E-2,9.82062879581624E-2,9.9502597194713896E-2,0.10083420368418,0.102201863423543,0.103607219752487,0.105051258147886,0.106537110422847,0.10806653823319801,0.109640270634617,0.111259228701192,0.112926347492979,0.11464488888037,0.11641835944305,0.118249626221978,0.12013955762457799,0.122091800106612,0.124110523250838,0.12619664982637099,0.12835537786842099,0.13059314103821201,0.132910854882723,0.135314463521402,0.13780854619986699,0.1403994912123,0.143093225266507,0.14589178882480799,0.14880549038384799,0.15183810904688499,0.154997519898603,0.15829404898300101,0.16173885912625299,0.165340251220021,0.169113940363494,0.17307442536919199,0.177233811501879,0.181607341030082,0.186215169101664,0.19106939595132499,0.196192300691958,0.20161093599393201,0.20734448297859701,0.21341560806256499,0.21986081361323001,0.226722587887279,0.234048324247076,0.24189233136760599,0.25029532230490498,0.25933667351731998,0.26906875049717299,0.27955412015889503,0.29093095047580297,0.30331531304346199,0.31684813649592403,0.33171462761735099,0.34810088709923598,0.36632884872462002,0.38668424777828397,0.40942635460044402,0.435141462885964,0.46466630618300098,0.49870460439250502,0.53765704361516997,0.58208935041958398,0.634144440399108,0.69579600430235,0.77109272871923795,0.86071569686469696,0.95079818925219195,0.99999999999996003,1]
[0.125,9.0952288360702405E-2,9.2009468954220297E-2,9.3091624732650105E-2,9.4199660636684099E-2,9.5334078916653103E-2,9.6496093403724101E-2,9.7687113062075503E-2,9.8908645516363095E-2,0.100161766213367,0.101447303460314,0.102764680732557,0.104114287546257,0.105498877692339,0.106920451850484,0.108381580600276,0.1098830766143,0.11142815350273901,0.113017665684515,0.114652332922156,0.116335218455939,0.11806904256336,0.119856263624132,0.12169923388114599,0.123601465614016,0.12555989688224001,0.12758122049609999,0.12966870533934399,0.131828032792108,0.13405949733290301,0.13636726216262701,0.13875957240020201,0.14123898267894799,0.143813614176446,0.146483314818841,0.149258028159067,0.15214579391962099,0.15515086112580601,0.15828273605433199,0.16154289917681799,0.16494287528863399,0.16849784754118499,0.17221710424116499,0.17611276779666599,0.180193940717356,0.184477148622297,0.18898611386396,0.193724416651746,0.19871593754077699,0.20398202994261599,0.20953953494440899,0.215413131547359,0.22163216105129399,0.228241719166144,0.23527699713339401,0.24275726244125301,0.25074401862177698,0.25930180175641299,0.26848509727228997,0.27832835431082198,0.28893627345859002,0.30042470053298798,0.31291129129546202,0.32657309801066298,0.341535833640224,0.35786711879750799,0.37593799298768499,0.39607127673884801,0.41849384457420702,0.44368579544831799,0.47233636656758399,0.50537810505668501,0.54366699077161595,0.58801250782643599,0.63962089286124302,0.69774539204200003,0.76333209228380705,0.84027916939825598,0.91678806389315104,0.97901018440841103,0.99999999999996003,1]
[0.1875,9.56665584155586E-2,9.6783235322607797E-2,9.7927051098968904E-2,9.9097875863595794E-2,0.10029724156412199,0.101523265893182,0.10277980672175201,0.104067177319531,0.105387326354795,0.106741498861604,0.108129464479905,0.109553379376988,0.11101247295229399,0.112509735436941,0.114048571055603,0.11563257181827701,0.117263058656303,0.118940196149357,0.120664764326184,0.122437399895649,0.124264582622633,0.126147630849891,0.128090423618439,0.13009539387410199,0.132167085577028,0.134307105141656,0.13651610057598701,0.13880125509256999,0.141165733446633,0.143610562695209,0.14614710720410901,0.14877588468885899,0.15150564487252199,0.15433888203181001,0.15728265762302199,0.16033895415964,0.163518488648071,0.166832075914885,0.17028837570463201,0.17389848054142801,0.17767460468929699,0.18162587239941499,0.18577134577972201,0.19012113718330101,0.19469157395164,0.199497174740491,0.20454453902116401,0.20986485173334599,0.21545836787100001,0.22134926558249199,0.22758303952728601,0.23419951470644501,0.241227633239746,0.2487207555049,0.25670847147650999,0.265219633134539,0.274353003996471,0.28410722881550798,0.29463137594533501,0.30602123832392097,0.31839594876376798,0.331863735057011,0.34649068544179401,0.36248201789207102,0.38012258826547701,0.39964182064721598,0.42136814940364697,0.445457883058682,0.47265535172443401,0.50349958456395505,0.53885474351409701,0.57986311147547798,0.62726808705360504,0.68266202439329204,0.74412866418184298,0.81197591127274504,0.88287799191675398,0.94731236332850799,0.99349515988602999,0.99999999999996003,1]
[0.25,0.100158185280039,0.101325231672932,0.102519099396334,0.103740224182246,0.104990454329227,0.106270368886521,0.10758262087277,0.108929101989201,0.110309767253766,0.111726537285376,0.113179803252072,0.11467093852523901,0.11620259659006101,0.11777664778856201,0.119392743708562,0.121053974348378,0.122762232525293,0.124519604775622,0.126327893517585,0.12818976273625901,0.13010899542902199,0.13208691345420001,0.13412744944948199,0.13623251819716301,0.13840583382136701,0.140648690456427,0.142966102250663,0.14536538099223101,0.14784851874591901,0.150418739159912,0.153082652244451,0.15584342517139901,0.15871226925485299,0.16169122959087001,0.16478283871315499,0.167997754771054,0.17134374006648301,0.17483816071268399,0.17848319116948,0.18229340320564399,0.186281583892175,0.190453248534417,0.194827624762306,0.199408246249444,0.20419919201445799,0.20922779177283801,0.21450525078539001,0.22005257185175001,0.22589939471829201,0.23208578054203599,0.238655233411048,0.24562340869222701,0.25303411881683902,0.26091988039161701,0.26933152638351898,0.27835202985382701,0.288017826140884,0.298355891712768,0.30949765756429098,0.32155500330381098,0.33457035557102499,0.34875034068010502,0.36423111699500799,0.38121247852738599,0.39989007029691598,0.42065765513585501,0.44371023272993798,0.469308665868305,0.49801904485376203,0.53060268592472304,0.56794018771454902,0.61088687460975599,0.66082021996732498,0.71749819040406704,0.78031767972321397,0.84847006032694905,0.91308889800259596,0.96727364874037702,0.99921276512736001,0.99999999999996003,1]
[0.3125,0.104481912542604,0.10570007513641699,0.10694683750105401,0.108222735851165,0.109529101380635,0.110866302046566,0.1122378711891,0.113645279692884,0.11508874053786899,0.11656300741789,0.118075155787151,0.119627963440237,0.12122248288104299,0.122861438509148,0.124546810397324,0.126280369973368,0.12806423046363899,0.12989743872527401,0.13178437911340801,0.133729373530349,0.13573499453323801,0.13780414618460801,0.13993793551251599,0.142141542503224,0.14441773390443699,0.146765214247947,0.14919083277469,0.15169566184079999,0.15428599191477199,0.15696951633737999,0.159754907308883,0.16264913485334501,0.16564950687379101,0.168766826098914,0.17201161424473399,0.17538676915299001,0.17890245357311099,0.182555648397592,0.186365454638872,0.190338822864734,0.194487616101784,0.198826748687191,0.203378841445367,0.20815142276179799,0.213151309332515,0.21838603068701201,0.22389422967473499,0.22968949652670001,0.23579789268144999,0.24226262274713301,0.249116261541834,0.25640627169512498,0.26417135427972699,0.27245083831745098,0.28127351940854001,0.29069481415366899,0.30079268296895001,0.31162773132428501,0.32325885259981302,0.33584875578444801,0.34951668980768202,0.36437751266145002,0.38064856256303897,0.398477170245017,0.41812259250887002,0.43989031863397099,0.46410325649754702,0.490896246244725,0.52104790667559497,0.55513344573353995,0.59401401862615599,0.63866602829305597,0.69037646501856098,0.74758981304908501,0.81108805678728901,0.87573427084162203,0.93590651067020303,0.98130771393623595,1.0000000000000899,0.99999999999996003,1]
[0.375,0.108736254010944,0.11000346780604101,0.111299654390573,0.112627349072871,0.11398366848295401,0.115370931766045,0.116792328143631,0.118250296833055,0.11974636412624,0.12128116613682299,0.12285562884286,0.12447042255049499,0.12612986636683701,0.12783486269853001,0.129588602210961,0.131391570543227,0.13324923422569601,0.13516051324442299,0.13712797291294901,0.13915421959169799,0.14124210592172301,0.14339667603568501,0.14562119174162999,0.14791781380587299,0.150286711882159,0.15272757071481499,0.155250789282084,0.15786316692948199,0.16057138481706701,0.16337869460005,0.16629014273590001,0.16930756175789699,0.172436602001976,0.17567836760574301,0.179047296031315,0.182555372802198,0.18619348250621301,0.18997833717999901,0.19393315282023199,0.19806892276593799,0.20239641981658599,0.20692438467823701,0.21166001191061801,0.21660692221792499,0.221790282034487,0.22724568440918499,0.23298644741299901,0.23901755567490099,0.245378638308338,0.25211668486938299,0.25928547424724102,0.26689437493250301,0.27498725532512402,0.283592707187722,0.29274343073075598,0.302573067119141,0.31308758336486803,0.32431530210546899,0.33643492441268602,0.349577858469383,0.363782353319061,0.37930867319629002,0.39633889883891699,0.41493379842967898,0.43535116153310799,0.458080485307229,0.483281141944294,0.51121831635963799,0.54262781492059098,0.57796852986592995,0.61803978101864399,0.66419180592300497,0.71692189215243896,0.77478863172462797,0.83751858330414997,0.89845505654219704,0.95378429199576797,0.99054680524139505,1.0000000000000899,0.99999999999996003,1]
[0.4375,0.112922184661974,0.114234416594757,0.115577896751703,0.116953683930206,0.118363701451425,0.119804760551384,0.121279911677517,0.122793393493438,0.124345113089117,0.125937387814922,0.12757181760602199,0.12925179924799801,0.13097842364336701,0.132752991349567,0.13457905034635001,0.1364564909871,0.13838678418803699,0.14037049470378801,0.142412657159013,0.14451577202066199,0.146683090102114,0.14892022989173601,0.151226312529982,0.153611223461916,0.156074202768133,0.158616708793196,0.16124343280002201,0.16396122029415,0.166773874657587,0.16968292945400401,0.17269956200951,0.17582410934820999,0.17906447100152501,0.18242432213048301,0.18591231110888401,0.189545608466823,0.193328658806386,0.19727176217737699,0.20138611204232201,0.20566992761674599,0.21014805051110699,0.21483359549577599,0.21974506575830999,0.22489735820246501,0.23030190030517,0.23596895620876701,0.24191969295263699,0.24818057794778001,0.25478869308736901,0.26179630809103599,0.26924347079983402,0.27713578417937901,0.28552488022579597,0.29445106394476001,0.30399202540164599,0.31416326061718902,0.32500530624575102,0.33665567665857099,0.34922402443428402,0.36287714923139203,0.37771798176240501,0.39389698624376202,0.41158427171727702,0.43083383911887202,0.45208783414222398,0.47568474413566397,0.50173698155995805,0.53083874401954101,0.56311014512508994,0.59962241584005405,0.64081432339309197,0.68822423453844295,0.74103661342947302,0.79973638263260005,0.86066144928935095,0.91792108899370495,0.96745499412925096,0.99631411294815098,1.0000000000000899,0.99999999999996003,1]
[0.5,0.117066518719372,0.118424333622159,0.119814836147531,0.12123936795324899,0.12269873365153799,0.124192203190267,0.12572428380890099,0.12729681023300399,0.128909565568847,0.13056359847174501,0.132261569890855,0.134006884293731,0.13580085899284799,0.137644005959947,0.13953567586468199,0.141478373307275,0.14347540417843799,0.14553231405914699,0.14765129381780401,0.14983031229551599,0.152076934834626,0.154397160682127,0.156790928388925,0.159263144868557,0.16181606496513301,0.16444914606274699,0.16716096015721099,0.16996376272757199,0.172869076946427,0.175882110332792,0.17900718058316001,0.18224296893457001,0.18560211249052899,0.189090389570857,0.19271561436694401,0.19647613064156499,0.20038719125673801,0.20445907102658401,0.208709751359448,0.21315801849674501,0.21780746766900999,0.22267674886269501,0.22778398877571901,0.23314163246506001,0.238729140775021,0.244563334209877,0.25071685153345302,0.25721809078286101,0.26407427751570201,0.271328859091859,0.27902677754895899,0.287216858811428,0.29593719048407002,0.30518624386286403,0.31499402007041,0.325470950757346,0.33668214140085301,0.34875660745398701,0.36182108259125101,0.37604776603555201,0.391461582207763,0.40816892184654002,0.42649560844391798,0.446450061142598,0.46843360351603103,0.49269336325153201,0.51979827934585698,0.54953166658091401,0.58307989636420898,0.62033475054413001,0.662695733320948,0.71071381381889198,0.76378068580199399,0.82247488155568904,0.88123637075933103,0.93555102297475101,0.97865879744325301,0.99923667649567904,1.0000000000000899,0.99999999999996003,1]
[0.5625,0.121172767406965,0.12258216746742299,0.124023730975375,0.12550054913474401,0.127013838443856,0.12856238162834799,0.13015106040642799,0.13178187151446299,0.133455525716908,0.135173195367572,0.13693614775366,0.138737388090337,0.14058883627431101,0.14249060095965499,0.144446558905381,0.146460025444202,0.14853023673341101,0.15065723092206401,0.15284392566861599,0.15509919203019201,0.157425243530456,0.15982393734976699,0.162292223518095,0.16483899993286899,0.167471137489625,0.17019072648157099,0.17299888107290901,0.17590583535850501,0.17891713490005101,0.18203357181843199,0.18526227616980001,0.18860627911251199,0.192071387356514,0.195673197976935,0.19941836192127699,0.203311684659989,0.20736611411469,0.21159455732187399,0.216005818860728,0.220610339276503,0.22543483454705701,0.230487307172102,0.235763321166088,0.24125186335042201,0.24700956985329001,0.25306258226029299,0.259439160703062,0.26614907727924397,0.27324044998173902,0.28075083986397897,0.28873101543345803,0.29720435817866198,0.30618781431776998,0.315684700937087,0.32578195843129298,0.33660658424012102,0.34823825717184897,0.36077330166932797,0.374353297117829,0.38908589137798399,0.404942587577163,0.42229346951782398,0.44119153475161599,0.46177070251679903,0.48438576403716499,0.509470476893086,0.53720436107338998,0.56796462571135997,0.60224087656289305,0.64045106170592503,0.68376381683832299,0.73158673614974401,0.78566286065976398,0.842931871406704,0.89893761916922199,0.95049241902079995,0.98699624715521606,0.99999281122505601,1.0000000000000899,0.99999999999996003,1]
[0.625,0.125263378927397,0.126722380275826,0.12821662394706099,0.12974760344938799,0.131316547110675,0.13292293605114,0.13456895601771299,0.136253566137467,0.137976089238392,0.13974354455692301,0.141558234979866,0.14342378540238501,0.145339908232512,0.14730700709709901,0.14932469185266201,0.151401685372787,0.15353804619752701,0.15573260950759801,0.15798962859006199,0.16030953777757101,0.16270272965705099,0.165174555771394,0.16772875886445399,0.17036508606276901,0.17309005024403201,0.175906106621709,0.17880795779366701,0.18180208320535399,0.18489674323404001,0.18810426574529501,0.19143669292260301,0.194895405730349,0.198480358559641,0.202204049568913,0.20608324494996799,0.21012128534009,0.214322227787896,0.21869434609732499,0.22325593264586899,0.228020363403663,0.23299299622112199,0.23818689832932499,0.243603364802366,0.24927501556273701,0.25523432256877399,0.26148698568003798,0.26806570661628598,0.27499934816944899,0.28232832953653603,0.29008634661124799,0.29830878854390602,0.30702111040517799,0.31624522474915201,0.32601820307150198,0.33645882947037697,0.34768020226766599,0.359731189547562,0.37273044437053399,0.386760764477797,0.40188368637876098,0.41834149135166399,0.43619800173023099,0.45561394956635798,0.47680857495005802,0.50005164368622101,0.52581182597964404,0.55431619989716996,0.58583195738621296,0.62092565061184901,0.65998195571101703,0.70368213185367801,0.75167478189477499,0.80579753425977996,0.86129439995020796,0.91496917001171796,0.96291537868380395,0.99309894135024201,1.00000000000005,1.0000000000000899,0.99999999999996003,1]
[0.6875,0.12934945089578401,0.13085986960368201,0.132402703908717,0.13398008203825201,0.13559611558005999,0.137247475572461,0.13894056954682099,0.14067805572538999,0.142459274148587,0.14428367388713401,0.14615620681458699,0.148077816480331,0.15004993556176499,0.15207360168874601,0.154153320703591,0.15628925606603999,0.15848332178923599,0.160743525879528,0.16307260370392099,0.165474520501081,0.16794888663487501,0.170503994727117,0.17314050909313999,0.17586124970373901,0.17866264131901199,0.18154814727891999,0.18453244805465399,0.18762023979304601,0.19082132669084501,0.194141296677457,0.19758358525833999,0.201153648125934,0.204863076287087,0.208721312011523,0.21273326032398401,0.21689172711996901,0.221219913035541,0.225731570038428,0.23043141064984601,0.23534553858669099,0.240450886934406,0.245783429267316,0.25138531374921802,0.25724545341128002,0.26339256178436998,0.26983358384217598,0.27661213295206399,0.28375754022836203,0.29130719716933101,0.29930504467812302,0.307753495383491,0.31669658355795599,0.32617913933354298,0.336286099861351,0.347090616173656,0.35869134161343602,0.37117282202613,0.384567843011551,0.39897300039688899,0.41461999604884298,0.43156134311803801,0.44985928734783298,0.46984395873774198,0.49154286079423898,0.51540705226039296,0.54188238745516104,0.57104134681372798,0.60334462324545701,0.63912882763921297,0.67878978442780202,0.72258472206928104,0.77116654843191901,0.82477488492493201,0.87795343702411099,0.92996860970288697,0.97327481219202105,0.99677400790301196,1.00000000000005,1.0000000000000899,0.99999999999996003,1]
[0.75,0.133410506167219,0.13496388342211901,0.136552484678715,0.13817872995246,0.13984366977342999,0.14154492136970501,0.14328966039495999,0.145078487300901,0.14691129215801699,0.14878559616738901,0.150707576367481,0.152682357456079,0.154707462698572,0.15678847017307501,0.15893034871925699,0.161135476496265,0.163404040848877,0.16573637382299999,0.16813689638173701,0.17061245615738599,0.17315889681708399,0.17578728076019201,0.178487750533389,0.18127793696130201,0.18416495535886099,0.18714949808113901,0.19023661643564699,0.193426619307631,0.19672678510021199,0.200151324416523,0.20370939591968201,0.20739932581881801,0.21122405611470901,0.21519136612092701,0.21931651076292499,0.22360254365603099,0.228055539559851,0.232701113416726,0.23754928768538899,0.24257516380553301,0.247840877706833,0.25334310922341502,0.25911845545297602,0.26515239075908198,0.27145637848283699,0.278085883361605,0.28506662722346698,0.29242553616702199,0.30021266810245401,0.30840698701460401,0.31707819120938702,0.32626565148088998,0.33606829116600301,0.34650346553037797,0.35765892948081202,0.36965884843441599,0.38249005819288001,0.396252540726655,0.41110721671101003,0.42721118665087598,0.44454086585395203,0.46336090817217002,0.48375349023311098,0.50601712696038403,0.53056783788270201,0.55753626066405404,0.58739849118571896,0.62040457306608598,0.65677463343666098,0.69694830463069501,0.74051548347290197,0.78968691574238803,0.84217915685255795,0.89349288260390103,0.94325363513543103,0.98153614893660002,0.99901880270580001,1.00000000000005,1.0000000000000899,0.99999999999996003,1]
[0.8125,0.13740731786207999,0.139002757218151,0.140635351856786,0.142306641714082,0.14401964129829301,0.14577112625543301,0.14756043261875099,0.14939563810973999,0.15127574765202101,0.153201395759722,0.15517925336234201,0.15721306239097199,0.159304985232084,0.16145337032471599,0.16365874033314901,0.165928906260429,0.16826187877819601,0.17065999565468801,0.17312884748374999,0.17567153996586199,0.17828476673646901,0.18098236879555599,0.183770242219845,0.186653797163951,0.18963741805811701,0.192715045228986,0.19589329275204001,0.19918172391019201,0.202591239766962,0.20611918396252499,0.20978193227149999,0.21357446207720801,0.21750761364919599,0.22158458693067301,0.22582490527749899,0.230240650065588,0.234840598512608,0.23960962481974199,0.24457353020011,0.24975492641090499,0.255181768513558,0.260852084390085,0.266761490098395,0.27295427176020898,0.27944787268159799,0.28626405587753001,0.29345738023678902,0.30102945226772698,0.308997694799651,0.31740631358895599,0.32631382595846897,0.33580458813235298,0.34589838117678701,0.35667053961238798,0.36819110236413299,0.38050548186440603,0.39367255185887001,0.40783889476187601,0.423140812399669,0.43958644667386199,0.45736963882995402,0.47653526189909001,0.497471356931735,0.52033848091778601,0.54534182468607095,0.57296305593227503,0.60348010749147396,0.63710811727058703,0.67386309728683502,0.71416903516077401,0.75820584510941902,0.80716343652851597,0.85761482445041004,0.90806519779371497,0.95479679293136099,0.98789494586356297,0.99984970554867503,1.00000000000005,1.0000000000000899,0.99999999999996003,1]
[0.875,0.14127125366152901,0.14291186258677999,0.144588489621648,0.146305126684311,0.14806009666945599,0.14985269667452999,0.15169034239509599,0.15357675412996,0.155512639627195,0.15749898408212001,0.159535060165786,0.16162609661316299,0.16377625982323801,0.16598166130273001,0.168248064657886,0.17057866008332401,0.17297724710930701,0.175445238892668,0.17797813497308301,0.180590764955088,0.183287585364347,0.18607328552862401,0.18895190537986101,0.191918821617411,0.19498715778263201,0.198159249862186,0.20143537153778099,0.20481984200999001,0.208323379414596,0.211956306160731,0.21571923736850401,0.21960581751243699,0.22364410721978201,0.22784601469451199,0.23222376196052899,0.236772494480884,0.24147697568698401,0.246370838218083,0.25147813145426701,0.256815645982856,0.26236799786034898,0.26817418241737701,0.27425949106302,0.2806272032953,0.28731463418098402,0.29435887491900897,0.301734424962046,0.30949295183098202,0.317664663038775,0.32630853112399699,0.33550439290395301,0.34526452767291699,0.355689349802495,0.36679855160018598,0.37860002429915501,0.39122656178355603,0.40477982229057902,0.41934635361528799,0.43497174290167101,0.451810276278511,0.46990715697855601,0.48956883621432801,0.51099894647386002,0.53435155024397996,0.55986246092940495,0.58805342882701594,0.61929502355739496,0.65326374029894796,0.69040534472524095,0.73065501141559397,0.77521398461087598,0.82360314741805996,0.87190219944056202,0.92126968488925798,0.96514198288303799,0.99290505148780905,0.99999999999998501,1.00000000000005,1.0000000000000899,0.99999999999996003,1]
[0.9375,0.14485723986607399,0.14653570454275899,0.14824973662785501,0.150006167780741,0.151806584993226,0.15364945628920201,0.15553883188238399,0.157476093110136,0.15946227618416001,0.16149911988989199,0.163590147628875,0.16573615250229901,0.16793979693310099,0.170207636174972,0.17254131000770201,0.17493900766397899,0.177397900825947,0.17993095097685999,0.182542132604635,0.18523594061774001,0.18801384230894699,0.190874225908858,0.19382962675608201,0.19688522611239001,0.20003683094553801,0.20329434185827899,0.20665898010223399,0.21014147658403901,0.21373866971493299,0.21745703892958201,0.221320742381823,0.22533385540369599,0.22950389991261,0.233829542133763,0.23832515583569699,0.242968415590395,0.247797376132737,0.252824083857138,0.25804919113383201,0.26351554174060698,0.26922734930242298,0.27520103893573999,0.281458878007455,0.28803349609283702,0.29493103572817397,0.30215466271314501,0.309730623013725,0.31770742152558501,0.326126170551163,0.33505101393428499,0.34451438358737702,0.35459711891475298,0.36533142537778701,0.37669613398244201,0.38880831800715399,0.40181368071564899,0.41572164017227498,0.430615170532404,0.446596598784613,0.46372933482612999,0.48228682641183301,0.50238284646462406,0.524333042040244,0.54813017788165797,0.57419662125770199,0.60296947514465005,0.63476152344162695,0.669021768773987,0.70634333325686205,0.74671569292255102,0.79144639216338397,0.83859020883048396,0.88547704248133197,0.93311935214890995,0.97371845442766902,0.99622824416133804,0.99999999999998501,1.00000000000005,1.0000000000000899,0.99999999999996003,1]
[1,0.148098963003371,0.149817002248185,0.151575485214233,0.153378152796215,0.15522364929801399,0.15711262167947099,0.15904748235642399,0.161033568141877,0.163066353161956,0.16515101779445701,0.167293902882449,0.16949795711690199,0.17176595316139001,0.17409183942654799,0.17648089540114001,0.17894125528824301,0.181473942122437,0.18408397020296099,0.18676841116543599,0.189532543570407,0.19238570634237601,0.195324954529696,0.19835625355811701,0.20148965818074799,0.20472746411640599,0.208072095223616,0.21152079976191099,0.2150773020091,0.21876755809120699,0.22259942927625501,0.22657980332160901,0.230703633227197,0.23498727280138501,0.23941203507561301,0.244001986430331,0.24875860856670801,0.25369843283145199,0.258850033785467,0.26423530837838299,0.26984837109837401,0.27570785292314098,0.281851403437687,0.288296274650506,0.29503684251443801,0.30209788099385099,0.309491754657228,0.317277029871955,0.32547959063227899,0.33415335695128101,0.34334307063047598,0.353119782897722,0.363510649091486,0.37450543907198902,0.38623053856411499,0.39874601008889698,0.41210116122875501,0.42636763050052701,0.44162102327214797,0.45786899761495897,0.475413345065472,0.494340583315657,0.51489765370660101,0.53730547808607998,0.561516702023935,0.58812495411911503,0.617597277128352,0.64963639966204201,0.68412248997569103,0.72162476573684597,0.76241195733242595,0.80695865177840997,0.85238069451475096,0.89848623885362,0.94390215581199899,0.98026404402183698,0.99858331480920404,0.99999999999998501,1.00000000000005,1.0000000000000899,0.99999999999996003,1]
[1.0625,0.15118617931426701,0.15293932385657599,0.15473400365812101,0.15657227011247701,0.158457073928015,0.16038109113680299,0.16235387704045501,0.164379615993268,0.166458919676406,0.168595169702175,0.17079039199487001,0.17303967171454901,0.175350513389257,0.17772906706135,0.180177825172879,0.18269981334642499,0.18528875385982499,0.187954502836266,0.19069867020570799,0.19352482917275601,0.19644114710932201,0.19944924411340501,0.20255575762668299,0.20576492989831399,0.209071339867721,0.212478318359692,0.21600463950923199,0.219659226966611,0.22345182637195701,0.22738178138251799,0.23146524349203701,0.23569231468107801,0.24005520264094299,0.244562945240588,0.24924346179714099,0.25410475702172503,0.25917921875501099,0.26446874600158699,0.269973367493063,0.27573411450719099,0.281775489754443,0.28810051560501798,0.29470383229705199,0.30160725350721102,0.308820215538542,0.31640148488569603,0.32437516287378199,0.33279591326701002,0.34171219377943601,0.35116946604072002,0.36119610903488902,0.37178517186408599,0.38308379296269501,0.39518337839979201,0.40803989251814299,0.42175186832268502,0.43635835409163198,0.45187049906695698,0.46852328823028599,0.48641397950596299,0.50581105886352695,0.52691894518401705,0.549692124601877,0.57455532280008004,0.60177594412528801,0.63176726375574499,0.66403312361858802,0.69871416424413801,0.73638220274400501,0.77730199454365501,0.82121926279278501,0.86506910242702295,0.91091235401710402,0.95380600528813897,0.986038428366804,0.99963037223324602,0.99999999999998501,1.00000000000005,1.0000000000000899,0.99999999999996003,1]
[1.125,0.154160749679154,0.15594875115845,0.15777549942670999,0.15964647274876401,0.161564962235307,0.16353051904962301,0.165548314041253,0.167620302320593,0.169745143879447,0.17191985565149301,0.17415222552199999,0.17644838745411001,0.178811456613273,0.18124158815234601,0.18373636015792599,0.18630220988298901,0.188940720637855,0.19165392439237999,0.194450800279934,0.197331599602691,0.20030191818350801,0.203368466417779,0.206528282808698,0.209787134853855,0.213158913249793,0.21664746762443399,0.22026060259399399,0.22399817645932199,0.22787495901906299,0.231894023238222,0.23604786424729399,0.240321109423318,0.24473903850036699,0.249332543656797,0.25411531189104503,0.25909133152130498,0.26426497522961001,0.26964666669298598,0.27528066122398698,0.28118354083781499,0.287352929993758,0.29379121610662801,0.30051605495719302,0.30755406994802298,0.31494475582742598,0.32270586965291798,0.33088592637058201,0.33953421002387002,0.348683765469887,0.35835355709231498,0.36856713273080999,0.37944004848070001,0.39106649566364399,0.40346379725647402,0.416690380828107,0.430746369499032,0.44559533089964698,0.46144113987218599,0.47836663656037298,0.49666327087853401,0.516544012258917,0.53798029334311703,0.56129579722499701,0.586665596633002,0.61452602679206503,0.644920377799301,0.67736149674734603,0.71259425073604898,0.75062151202497596,0.79164746695358901,0.83434185528536198,0.87709879417799097,0.92222647701507499,0.96244441100169698,0.99081815342573698,0.99999149208522797,0.99999999999998501,1.00000000000005,1.0000000000000899,0.99999999999996003,1]
[1.1875,0.15699581969162499,0.158816546697681,0.16068320349607301,0.16259708946256701,0.16455966438571301,0.166570335028394,0.16863085639941999,0.17073959762972299,0.17289834563453299,0.175117446550352,0.17739839093162299,0.17974090301718501,0.18214493380399099,0.184613357615174,0.18715164692793301,0.18976185891116301,0.19244660322746901,0.19520879664340099,0.198053906990246,0.20098640503055001,0.20400518520980801,0.20711819337243401,0.21033382662184599,0.213660790020539,0.217105091300444,0.22066387096287299,0.224347141337322,0.22816001768966801,0.232096836360144,0.23616022319247101,0.240346224112405,0.24469068219089701,0.24919797647571301,0.25388602706018898,0.25876374156878801,0.26382316861126498,0.26909455343236,0.27460110060585402,0.28035059178911798,0.286349486700814,0.29261663878169403,0.29914707374108801,0.305990965615827,0.313151259342138,0.32066894300733401,0.32859113328470202,0.33695791135882902,0.34578548959604199,0.35510748400798697,0.36495053080782203,0.37540356855874102,0.38655442136511498,0.39841740496598099,0.41107682929648098,0.42457332634988798,0.43886993889113401,0.45400844674819901,0.47005083251095803,0.487296081514414,0.50600422219727204,0.52623205693350605,0.548018668648245,0.57181160000179798,0.59777210518892798,0.62615639988758198,0.65675756161797605,0.68959622380613705,0.72533940666813101,0.763820849652735,0.80478368885320695,0.84657061559277402,0.888589872556654,0.93217231629807995,0.96944998589414899,0.99424697104408499,0.999999999999999,0.99999999999998501,1.00000000000005,1.0000000000000899,0.99999999999996003,1]
[1.25,0.15969645431702501,0.161553620717103,0.16345726109295799,0.16540889647270299,0.16740570841194499,0.16944895462156501,0.17154012906607999,0.173687413509615,0.17588907900772299,0.17815069376457801,0.180466400749908,0.18284581692618401,0.185290585509962,0.18780532532858099,0.19038857406572099,0.19304351288185601,0.19577809824144801,0.19859106572004001,0.20148414701637701,0.20446635783521999,0.20753838748001299,0.210713539466754,0.213997605125087,0.217388433840009,0.22089395460507,0.22451821848739301,0.228255156199412,0.232113856212326,0.23608474557409301,0.24018744058601399,0.244443428971757,0.24885828357950099,0.25343998690723102,0.25819378258297498,0.26314137421733402,0.26829035848778199,0.27366772927551403,0.279276539954047,0.28511619146530898,0.291201751522983,0.29755475337479798,0.30420801977124201,0.31116100934864199,0.31845547871413599,0.32611996832179702,0.33420792742905098,0.34270455155225099,0.35167769491331102,0.36114831583118001,0.37118876387345301,0.38188784807042397,0.393256226256324,0.40535823888114603,0.41826325150065702,0.43192853866122799,0.44648805804778102,0.461780086744639,0.47806569930491699,0.49566370562669299,0.51469261006020295,0.53514078639971097,0.55739833811220296,0.58155634941026901,0.60785616782987795,0.63653307229019496,0.66711241249965503,0.700660918137335,0.73697246054549204,0.77584310227813202,0.81646259326023396,0.85722827563130199,0.89919156646780296,0.94122213460259496,0.97542864054961798,0.99667523898439603,0.999999999999999,0.99999999999998501,1.00000000000005,1.0000000000000899,0.99999999999996003,1]
[1.3125,0.16228075368780101,0.16417162066320501,0.16610501623016599,0.16808724663605301,0.17011311402336901,0.17218861111866399,0.17431610082544999,0.176497559595127,0.17872715854551199,0.18101922379327301,0.18336977391252601,0.18578626423064801,0.188265766852664,0.190815304859563,0.19344022820304899,0.19613611291014801,0.198908795500922,0.201767213820644,0.20470622800192501,0.207738696040105,0.21087126673649001,0.21410485754045899,0.21744511522285301,0.220896058358101,0.22445214965850099,0.228124143289022,0.23191069656652799,0.235804862385288,0.239835741875328,0.244009761405346,0.248337400293487,0.25282025540786601,0.25747484314580998,0.26231349439544099,0.267351535129419,0.27259911741591603,0.27806169895882399,0.28373853011565697,0.28965037287585599,0.29582191336746899,0.30227869440836103,0.30901617241026802,0.31608397692448598,0.323491775830409,0.33129086051822998,0.33947875094748298,0.34811519578330502,0.357226825264019,0.36686214742794399,0.37710790061593003,0.38797956704084602,0.39953013976739399,0.41184798330438699,0.42489098446121598,0.43877452764667502,0.45351491711758701,0.46907970816271199,0.485722301472226,0.50356185089426697,0.52278916252934104,0.54354738956897897,0.56606079332929304,0.59060799364861005,0.61733272674180495,0.64589689428701802,0.67661645180031005,0.71060433732351802,0.74725291206457201,0.78654483324138202,0.82680833477383398,0.86664255910078702,0.90914639001306696,0.949454670426508,0.98078431177515701,0.99830880683378798,0.999999999999999,0.99999999999998501,1.00000000000005,1.0000000000000899,0.99999999999996003,1]
[1.375,0.16480228259714599,0.16672076294875199,0.16868250605374199,0.17069244815926901,0.17275132165079901,0.17485527038518001,0.17700896500865701,0.17921747244637701,0.18148105794353001,0.183804445006402,0.18618447599590399,0.18863290814668701,0.191150686233376,0.19373511241281699,0.19639322176955501,0.19913121705784101,0.201945785551848,0.204844774249371,0.20783479281596701,0.21091690010307201,0.214095802564711,0.217373267676016,0.22074998728775799,0.224242151552382,0.227837676704644,0.23154551067464599,0.23536220673875499,0.23930803441222601,0.243390902815525,0.24761765894441401,0.25199816484391002,0.25655305016511498,0.261285996661555,0.26621372705954999,0.27134485306223699,0.27666936388632701,0.28219841437242399,0.28794535166586299,0.29394487151582599,0.30021049239421399,0.30674991963255399,0.313596426346058,0.32077646681726801,0.32831280856634898,0.33620887725694198,0.34453067857553898,0.35329814597631498,0.36256255780783803,0.372389150439565,0.38279254064976898,0.39382727166396603,0.40558678762819,0.41800448678806301,0.43119443090786502,0.44520414874736502,0.46013749153276001,0.475996874112808,0.49293291260919703,0.51105602778588299,0.53044351125654299,0.55147636774040298,0.57429370256178203,0.59904264246009298,0.62602444531600498,0.65447111963790805,0.68557439337632897,0.719845785543346,0.75669518655564305,0.79584954700709798,0.83589922263357297,0.87517545675356101,0.91772321094667397,0.95635530924645895,0.98499233231711902,0.99931844344415899,0.999999999999999,0.99999999999998501,1.00000000000005,1.0000000000000899,0.99999999999996003,1]
[1.4375,0.16717380092308501,0.16911794572108399,0.17110747707702101,0.173139780209281,0.17522035877481901,0.177350706802819,0.17953560382859299,0.181772343221835,0.184065263550933,0.18642260979293501,0.18884253338838899,0.19132517140903799,0.19387882845111501,0.196507807937113,0.199209707609911,0.20198808555327299,0.204850038146005,0.207797601893186,0.21083196539611601,0.21395269312711501,0.21716725961919001,0.22048984589944001,0.22391342568323599,0.22744433612243101,0.23107422662538099,0.23481713363012599,0.23868256328929299,0.24267514109169899,0.246804183808807,0.251090247648939,0.25554650581513899,0.26016736185678202,0.26497501984970401,0.26996828927133398,0.27515351807489902,0.280529001871965,0.28611962792639201,0.29194629501682801,0.298030540883226,0.30437837031617399,0.31101760911104698,0.31796751020693498,0.32525110321164702,0.33286908421303901,0.34087555998621299,0.34930704232628701,0.35820574776206798,0.36762492366143601,0.377578281323593,0.38812217023713602,0.39935235763229399,0.411200405200357,0.42375935383931002,0.43708113444898999,0.45123041870068198,0.46639145711417901,0.48254427867392702,0.49978473018334202,0.51811439840575702,0.53777163885943102,0.55896497428334102,0.58191467122001905,0.60699004673927504,0.63389226190270298,0.66239658733597095,0.69387573879762898,0.72824308305279195,0.76536272002464001,0.80431059864959098,0.843761575200495,0.88292323165146602,0.92476944402045802,0.96155783917044102,0.98847696060059598,0.99980516012060305,0.999999999999999,0.99999999999998501,1.00000000000005,1.0000000000000899,0.99999999999996003,1]
[1.5,0.16943688854625699,0.17139833711125299,0.17340611440255199,0.17545992464089999,0.177565423478632,0.17971549189126401,0.18192175234385999,0.18418751325424701,0.18650912039342299,0.18888963227168101,0.19133728321424201,0.19385535769991999,0.19644665806624201,0.1991070872191,0.201847114071977,0.20466796238030299,0.20756779721927199,0.210545118768873,0.21360975060694201,0.21677278810758299,0.22003638539012299,0.22339125699996601,0.226852232156524,0.23040342768835101,0.234068933406201,0.23785018093628499,0.24175267023077099,0.24579152365162901,0.24998452079545999,0.25434018107053502,0.258856430829493,0.26354398398932999,0.26841148560373501,0.27345641158402001,0.27869158421740597,0.28413425219606803,0.28979290559709597,0.29570056790288002,0.30185989158513699,0.30828894431634901,0.31502297960460202,0.32206041989152001,0.32942898951120803,0.33715140411542899,0.34526439488536498,0.35382170417157599,0.362856947858473,0.37238843487776102,0.38247023061870999,0.39318514166264401,0.40450791454692298,0.41647463893512598,0.42912075708625602,0.44253641856254899,0.45687319709135399,0.47224095856076997,0.48863110939300702,0.50612213886268598,0.52468669936039203,0.544579839351921,0.56596884851403595,0.58906207753790396,0.61421639173156695,0.64100072883473302,0.669881348505314,0.70153965053335798,0.73594408173686898,0.77320092439336896,0.81189183555670397,0.85059186053939595,0.89006936095871403,0.93102981391251405,0.96596296732572495,0.99126252779114199,0.99999999999998002,0.999999999999999,0.99999999999998501,1.00000000000005,1.0000000000000899,0.99999999999996003,1]
[1.5625,0.17156271097412701,0.173543679500407,0.175571613932853,0.177644539550639,0.179771253012,0.18195265853956799,0.18418679840000099,0.186476218054593,0.18882772338804901,0.19124347040586001,0.19372773895222101,0.19627742589866001,0.19890005533903399,0.20159929973153701,0.204371080978586,0.20721572524319501,0.210139760289308,0.21315513966650901,0.21626584286034001,0.21946825245311799,0.22276864836121099,0.226153190930902,0.22963451055994799,0.23321817173337001,0.23691572833556199,0.24073275493445701,0.24468613731858299,0.24878266486869199,0.25303516477132498,0.25744023375119102,0.26200901134917398,0.26674493909528701,0.27164743179195999,0.27673338398672698,0.28202278239537099,0.28751442560448298,0.29324175621142601,0.29921040324702097,0.30544901878684799,0.31197269221655299,0.31876517810580002,0.325877715864066,0.333330323437175,0.34114865788575199,0.34938308513949201,0.35806051654433502,0.36719594000238498,0.37684567702963101,0.38707302810667299,0.39787712792471103,0.40930656421200601,0.421350770118462,0.43408682871777099,0.44766963269451598,0.462158750859476,0.47769302857353402,0.49431124462093501,0.511927374227093,0.53083125321831104,0.55092988378381702,0.57242035030123695,0.59578026856085398,0.62087594776959198,0.64761013687082303,0.67687966046681802,0.70867273584349,0.74310666659243796,0.78034845437964095,0.81894946277479597,0.85709582083533498,0.89685128267849001,0.93672251098168902,0.96996612747509703,0.993386794168724,0.99999999999998002,0.999999999999999,0.99999999999998501,1.00000000000005,1.0000000000000899,0.99999999999996003,1]
[1.625,0.17355011094001199,0.17554774869522399,0.17759550516834799,0.179693048400665,0.18184033600223201,0.18404033862506899,0.18629922814987601,0.188619044348316,0.19100197098883401,0.19344832523311101,0.19595971240479099,0.19854316755697801,0.201191677687275,0.20391015589858,0.20670375843733599,0.20958203237732101,0.212545834420171,0.215599940474587,0.21874263749335801,0.221983368081175,0.22529875730791701,0.228702665471781,0.23220609972400699,0.23581595053775001,0.23955114749609799,0.24342077257817299,0.247431005705535,0.251586356898367,0.255887325915157,0.26034371205458801,0.26495767609503901,0.269728446677378,0.27467274265129199,0.279805976310538,0.28514139348463102,0.29069605979643598,0.29648001978175498,0.302518360271265,0.30883626907100498,0.31540125523999901,0.32226894216624202,0.32944870125270398,0.33698504692483799,0.34490862480482398,0.35323461529538402,0.36199106818503801,0.37123713774413097,0.381016541397107,0.39134112595465698,0.40223332093047898,0.413723491848773,0.42584842152931901,0.43870378488019801,0.45238989766539001,0.46702738806039301,0.48270624755661301,0.49950356986341998,0.51731801839468805,0.53643009791265805,0.55675256394327199,0.57848962344377797,0.60186959843413401,0.62688436454714902,0.65382715812099301,0.68342927858263602,0.71523072548716904,0.74976458713008998,0.78701294564581503,0.82535118950196795,0.86328046527734503,0.90321129525556298,0.94186304624863304,0.97376874773071598,0.99488362196741498,0.99999999999998002,0.999999999999999,0.99999999999998501,1.00000000000005,1.0000000000000899,0.99999999999996003,1]
[1.6875,0.175420262461498,0.177437699928576,0.17950195415982501,0.18161691344310599,0.183787141944668,0.186014558881996,0.188301734086777,0.19065001065667,0.19305519822540801,0.19552807766792199,0.19805887555580201,0.20065612918736001,0.203322798362916,0.20606847345045301,0.208897050504118,0.211811286523298,0.214806561685327,0.21789333785620699,0.221063564914876,0.22431405153094,0.22764446329189,0.23106688731144201,0.234598908817781,0.238250946961932,0.242031876377163,0.24594940942820101,0.25000541022255901,0.254194115540892,0.25853338168329498,0.26302286340353498,0.267657940360992,0.27246073715062002,0.27744610238270401,0.28262711002325902,0.28801964318574003,0.29362904248462801,0.29947890890145101,0.30558201833813098,0.311932405491469,0.31856739973757903,0.32548579770585701,0.33274150843596001,0.34037347206992502,0.34837336893802301,0.35676460827609202,0.36562192279043498,0.374967320737294,0.38483589601326001,0.39520978799543299,0.40617518145315101,0.41773161794644098,0.42997669480420497,0.44294960452469401,0.45676861944289598,0.47150677831335802,0.48728492861147699,0.50415856549693605,0.52220906213012597,0.54140579488455398,0.56193434596639102,0.58394913837413198,0.60730230342666802,0.63232821825093699,0.65966297247838401,0.68944162107037998,0.72133214545900204,0.75606116081535202,0.79318895281073398,0.83090503913632896,0.86914437516551002,0.90899251301082795,0.94586845483700599,0.97704106356063203,0.99583410140634798,0.99999999999998002,0.999999999999999,0.99999999999998501,1.00000000000005,1.0000000000000899,0.99999999999996003,1]
[1.75,0.177196002301371,0.179230970555325,0.18131784035019299,0.183458571724604,0.185655515402399,0.187910509582213,0.19021979758774399,0.19258910675164001,0.19501099296011701,0.19749442298630701,0.200041494841947,0.202662247212334,0.20535939833979799,0.208135906243408,0.21099322594699399,0.213930121537344,0.21695610647754701,0.22005130313257901,0.223222239274911,0.226478136950098,0.22982287397808199,0.233274395449144,0.23684437315255599,0.240538452983238,0.24436375093044099,0.24832155797039901,0.25240419784611601,0.25662812158307602,0.26099390181086801,0.265501009736551,0.27015814289307499,0.27499503575735801,0.28001940182094798,0.28524104481011697,0.29067682593289401,0.29633640431236702,0.302229580242317,0.30836199714295598,0.31478037840572698,0.32145597272252502,0.328447238961451,0.33579016303344,0.34348686409066498,0.35153456856867998,0.36001290271338998,0.36894234287716998,0.37836476385071399,0.38824615986896299,0.39868977785326598,0.40970276622155999,0.42137204779756399,0.43369530596013001,0.44676230506431402,0.46067493435534701,0.47550470060910399,0.49139219928025901,0.50835866528880702,0.52649086292859004,0.54580622368510101,0.56650754089370203,0.58861061020605998,0.61208295329948803,0.637314911346058,0.66492310508740105,0.69466170954584205,0.72654615912989895,0.76151185981631098,0.79863260585925699,0.835898315629928,0.87468736116202705,0.91421059598462495,0.94926476430721596,0.979665373104882,0.99664151301451398,0.99999999999998002,0.999999999999999,0.99999999999998501,1.00000000000005,1.0000000000000899,0.99999999999996003,1]
[1.8125,0.17881889433537901,0.18087795220389699,0.18298945317554699,0.185155464351272,0.18737478002274599,0.189645754870269,0.191968325263734,0.19434780468812399,0.19678519327052299,0.19929119087045499,0.20186833732587101,0.20451925699547699,0.207247990943105,0.21004981869271,0.212934491894539,0.215897993068391,0.21892592449602299,0.22202438901604801,0.22520416038285601,0.22848412616185201,0.23186831036172401,0.235359638681405,0.23896898643385001,0.24270366032950499,0.246560475159815,0.25054021115338498,0.25465350178977703,0.25889696391883199,0.26327405159177297,0.26779795834118197,0.27249461203822001,0.27737105322024602,0.28243319964723101,0.28769997319959401,0.29318273254819499,0.298880751888775,0.30480380337789598,0.31099375778351701,0.31743615569192302,0.32417497737225498,0.33123866513273698,0.338637303831331,0.34636840852984901,0.35450132513542898,0.36305142028399301,0.37206309061539899,0.38149490353126497,0.39143354423104998,0.40189395433880098,0.41298625049585502,0.42474893568600203,0.43713393690585101,0.45027632505369602,0.46427057027928798,0.47919182964167201,0.49509740111045902,0.51218459522010895,0.53032570225994302,0.54966259311944199,0.57047081549200196,0.59263971493130296,0.61624851032960803,0.64174363240656895,0.66947237334699805,0.69913154381647702,0.73119213438522002,0.766175602683414,0.80332606830981002,0.84026014254160897,0.87954290820181702,0.91857649101815597,0.95242403374279105,0.98200013218874804,0.99730992416876296,0.99999999999998002,0.999999999999999,0.99999999999998501,1.00000000000005,1.0000000000000899,0.99999999999996003,1]
[1.875,0.180264361308515,0.18234286242037201,0.18447337980328599,0.18664849641657599,0.188874077182941,0.19115205227434101,0.193484876089658,0.19588056201300799,0.19834142807289601,0.200871631174247,0.20347368526513199,0.20614763239256001,0.20889425362331501,0.21172256422138799,0.214616536809311,0.217571888431701,0.22059541583741701,0.22370486283133201,0.22691396237328099,0.23022747106011901,0.233645650108458,0.23717244290237199,0.24082046855125999,0.244579716187172,0.248461088023997,0.252470721185373,0.25660582822641997,0.26086032987638302,0.26526179766691099,0.26982281746567599,0.27455447978334901,0.279465388095469,0.28456935170320202,0.28987126608116898,0.29537636122295202,0.30109690939503603,0.30707413433817599,0.31328888529215598,0.319799004321212,0.32660896872028899,0.33372618321785102,0.34114618114781498,0.34894401285983701,0.35712975880692699,0.365733634561068,0.37474611093509902,0.38422748819186398,0.39419681876658602,0.404741169882324,0.41593176020697098,0.42773858087454902,0.440232452433236,0.45346659203851802,0.46750539984138401,0.482467915807401,0.49846231096965499,0.51553698424572802,0.533661694743092,0.55312684068394102,0.57388814176822101,0.59603882444311795,0.61997575676709904,0.64589299182424098,0.67356804873232701,0.70314756462163697,0.73528871848493904,0.77013438798452205,0.80725388157015099,0.84417018232424101,0.88383143023849797,0.92231541829516905,0.95539904682257604,0.98391015307448004,0.99787149178007495,0.99999999999998002,0.999999999999999,0.99999999999998501,1.00000000000005,1.0000000000000899,0.99999999999996003,1]
[1.9375,0.18162002147777401,0.183705031357874,0.18583729067857699,0.188017871818113,0.190250041139016,0.19254021913069999,0.194891765402984,0.197307263458808,0.19978857342973499,0.20233983125114799,0.20495541614868701,0.20764583605016801,0.21041098555632401,0.21323625569684401,0.216115956558637,0.21906450696562299,0.22210260584286201,0.22523615048097201,0.22847020925956901,0.2318094608745,0.23525484141136599,0.238810769619652,0.24246739490991701,0.24624234801959,0.25013891817880302,0.25415499798202301,0.25828635185666199,0.26255931138476002,0.26698319795088599,0.27157005741165602,0.27632947418526499,0.28127322957033202,0.28640157062989202,0.29172167806604798,0.29725512706895002,0.303027100624159,0.30902432570809102,0.31529938435615401,0.32187332001174601,0.32876251897418801,0.33592902091464399,0.34340663667747801,0.35125279720944003,0.359478552356155,0.36809141567604198,0.37712001792632199,0.38662221894031801,0.39663174452318301,0.40725525911798,0.41845759626670798,0.43032510171118299,0.44292226345560998,0.456256069919172,0.470413629835989,0.48540258633454297,0.50143282017276902,0.51848684097072395,0.53658901349019394,0.55606961401295496,0.57675432837664398,0.59890681799330503,0.623126923835712,0.64929056593466195,0.67689818107627098,0.70653733887147696,0.73871609931348303,0.77345194688046104,0.81029530483370504,0.84735862260846495,0.88713241415424704,0.92566977917167603,0.95828725135114601,0.98546821524792205,0.99836622823056898,0.99999999999998002,0.999999999999999,0.99999999999998501,1.00000000000005,1.0000000000000899,0.99999999999996003,1]
[2,0.182822260582091,0.184911550574519,0.18704908114712801,0.189240306016494,0.19148855081386601,0.19379608804384499,0.19616551156847101,0.19859947306366599,0.20109622071193001,0.20365838935618799,0.206293434808762,0.20899253519219099,0.21175104839206599,0.21456371886768999,0.217446817018279,0.22041679558312099,0.223477166995593,0.226633663789162,0.22989141657683701,0.233255010252371,0.23672045166084801,0.24027902533057099,0.24394838419598699,0.247732257676505,0.25162699750083101,0.25563840443369301,0.25978769017827802,0.26408908200912201,0.26854307180850001,0.27314986298197802,0.27794084433406502,0.28291522219526899,0.28805239104519598,0.29339097832088901,0.29895192288859102,0.30472989341797901,0.310771392971747,0.31709324846065101,0.32371088675540499,0.330618328779267,0.33786086055082298,0.34543153100058899,0.35333362636055299,0.36158916868688001,0.37021414146762099,0.379282835814509,0.38882207046627798,0.39890106801106201,0.409549277091382,0.42078906797018201,0.43269602261506601,0.44538026708484602,0.45880460511023002,0.473008903218892,0.48806883417244301,0.50408379687559701,0.52107704622519002,0.53924447101761097,0.55862901587332103,0.57921428014975795,0.60151303410245105,0.62593166549484103,0.65218222857501096,0.67983151549383602,0.70949152220064804,0.741677381591757,0.77654515360045895,0.81291091283198902,0.85028538998971204,0.88990262032102496,0.92850084900979402,0.961085183550485,0.98665453838531303,0.99878740393905296,0.99999999999998002,0.999999999999999,0.99999999999998501,1.00000000000005,1.0000000000000899,0.99999999999996003,1]
[2.0625,0.18385026796325099,0.18594762390908601,0.18809846836172001,0.190304843510017,0.19256915228287699,0.19489336517445899,0.19728000369773699,0.19972312046562499,0.202233074625005,0.204809803479341,0.20744315426724699,0.21012700363908801,0.21287354755381399,0.215702088770096,0.21861599142308899,0.22161115522595901,0.22469331833217299,0.227871313759161,0.23115114550965801,0.23452885210468799,0.238000103060938,0.24157860290366401,0.245256269720424,0.24903699246463001,0.252930938310165,0.25696016603127902,0.26113599157948097,0.26545676388109202,0.26993755388802898,0.27458883628804698,0.27941011258743997,0.28439170407155201,0.28955045425060499,0.29490901263295,0.30047560797384798,0.30628962970511098,0.31236780481804799,0.31872184869926901,0.32534665923154699,0.33228749550754999,0.33957663583220599,0.34720371948133899,0.35514322568441697,0.36341215204682498,0.37209813078862303,0.38120180857675701,0.39081717510803299,0.40095244785950801,0.41163547584633797,0.42291177812356501,0.434881457237281,0.44759053999367399,0.46110353549287503,0.47538203245329202,0.490433022122644,0.50639043806291795,0.52338526756996195,0.54150567958947404,0.56078574100452405,0.58142472840063197,0.60391000253403304,0.62848991220238404,0.65469749873314897,0.68246557818790499,0.71221029181709405,0.74437686286598204,0.77944535297178397,0.81541347494284699,0.853026269150574,0.89241530559026405,0.93096415768746799,0.96347747615942803,0.98772112346696195,0.99911618223939103,0.99999999999998002,0.999999999999999,0.99999999999998501,1.00000000000005,1.0000000000000899,0.99999999999996003,1]
[2.125,0.18477527402577701,0.18688479766836,0.189048282253063,0.19126765699333301,0.19354537139028,0.19587923730123799,0.198272119073166,0.20073007752261601,0.20324048535738501,0.205808612559265,0.20841663579303299,0.21109974722792399,0.21386176592755399,0.21670615285146499,0.21963633800508001,0.22265517245694699,0.22576226833367999,0.22895808319028099,0.23224453965492101,0.235628693044932,0.239111892479935,0.242695685983218,0.24637634787267099,0.250153646460543,0.25406248290351002,0.25811315156871301,0.26230047902655801,0.266638158404505,0.271142682354931,0.275819142415139,0.28065316902722498,0.28566548230289701,0.29084861741828399,0.29621222986011198,0.30181005128731198,0.30765678982620598,0.31376339312020901,0.32012318422712299,0.32677844261561501,0.33375904474136697,0.34106973625150599,0.34872389854425301,0.356683015408153,0.36498390593347801,0.37370909592670298,0.38289420437010102,0.39256214153428798,0.40273706655700298,0.41345133599058298,0.424776096933355,0.43677491768361298,0.44953552263930202,0.46312674530412401,0.47748547294416299,0.49255415681804499,0.50842675391231795,0.52544095573364102,0.54343080429733104,0.56260571456638298,0.58336147125507998,0.60599948207159504,0.63064796114544797,0.65699430119485802,0.68486283619070598,0.71479712907216797,0.74697428092648299,0.78207043306984703,0.81780003052861705,0.855668635136835,0.89484168607941506,0.93341598010459903,0.96571659817351796,0.98863472767334903,0.99928051997397505,0.99999999999998002,0.999999999999999,0.99999999999998501,1.00000000000005,1.0000000000000899,0.99999999999996003,1]
[2.1875,0.18562825364373001,0.18774894642027801,0.189923912869084,0.192154687722078,0.19443619839176099,0.19677831709583399,0.19917718175527299,0.201629767455308,0.204121391460548,0.206669590431068,0.20929053693532401,0.211987355808085,0.214763575825062,0.21762265780165099,0.22056800242996599,0.22360301665248999,0.226725615757984,0.22993794159119901,0.23323222083414799,0.236618754498025,0.24010603100806699,0.24369310313842801,0.247372813225327,0.25117773682919697,0.25510518191447401,0.25916216508330903,0.26336525343828199,0.26772312170088203,0.27224212125233299,0.27691218429624698,0.28176837064635502,0.28680049102791,0.29199759974626399,0.29739874253274801,0.30302469578831398,0.30890080470539899,0.31500823068244699,0.32139128016469298,0.32807844110512302,0.33507220608473598,0.342389288432214,0.35004713126493398,0.35803366664120401,0.36637400401456699,0.37514373621636998,0.38441321523730498,0.39409969995251198,0.40430106908473101,0.41505917964060202,0.42643978695128898,0.438466806160422,0.45126245629129103,0.46490404263702401,0.47932569579071999,0.49436250500259898,0.51025111332768502,0.52719537919146098,0.54507349564903895,0.56421508635616402,0.58509440889599595,0.60777011347093102,0.63237220644646996,0.658877514333433,0.68684177534651303,0.71695094757705502,0.74935801853292405,0.78437814376359205,0.82009762167216604,0.85819958795762696,0.89708170134418996,0.935702642087614,0.96762727044784402,0.989371785165302,0.99942091187680304,0.99999999999998002,0.999999999999999,0.99999999999998501,1.00000000000005,1.0000000000000899,0.99999999999996003,1]
[2.25,0.1864218840429,0.18855379527176699,0.19074029834867301,0.192979620195072,0.19527261608678501,0.19761193181105099,0.20000669075406699,0.20243968249722699,0.20492973315021901,0.20748997893151999,0.210123398148053,0.212833132735466,0.21562247583588801,0.21849501182309899,0.22145454791847599,0.22449584475989701,0.22762386344306901,0.23083895801055099,0.23414197870943401,0.237541826755439,0.241032422595472,0.24461800372811199,0.248317593529195,0.25214275685305498,0.25609065805049802,0.260165846023313,0.26438933789594599,0.268757331143895,0.27326949357608399,0.27795839816248602,0.28281839843123302,0.287857747456299,0.29309462517648099,0.29853106687363401,0.30419078143977901,0.31007824266355899,0.31620502544884399,0.32261593824335699,0.32931189790418602,0.33630994742039899,0.34362834813177301,0.35129721603317898,0.35929144027682097,0.367692876826616,0.37653210898186901,0.38582936689819503,0.39557695597237402,0.40579811796651799,0.41662212732862303,0.42803636396049199,0.440089425661291,0.452919631920984,0.46658498510672602,0.48101183657109498,0.49600301227889798,0.51191716580476299,0.52873556942962796,0.54653600410500203,0.56575274168944401,0.586707503715172,0.60946304782016003,0.63401671154299899,0.66052098184994301,0.68870324612510603,0.718892621417075,0.75159043433252704,0.78655421828229699,0.822282108777174,0.86054019723006703,0.899268076684833,0.93790320200534705,0.96934760825896904,0.98998725771281504,0.99956130377963104,0.99999999999998002,0.999999999999999,0.99999999999998501,1.00000000000005,1.0000000000000899,0.99999999999996003,1]
[2.3125,0.187128562414381,0.18927156017625099,0.19146917344567799,0.193711507335457,0.19600009457002199,0.19833496800839301,0.20073058184224299,0.20316925110180001,0.20567047835520899,0.20824231313326799,0.210887603365744,0.21360935187774999,0.21641129576281001,0.21929464000133,0.222256846241008,0.22530435704886201,0.22842881992882799,0.231644518074928,0.23496051673957699,0.238368070055133,0.24186540607877999,0.24546728124341799,0.24918399454828999,0.253013057200215,0.25697884276882499,0.26108793918412998,0.26531773035756601,0.26968203311859601,0.27421422778250998,0.27890936160438801,0.28378735569562402,0.28884972849329299,0.294112819279295,0.29959294919886398,0.30527879160231303,0.31119279604461603,0.31734548470366902,0.32376301710827199,0.330463502346177,0.33746257236666,0.34478713890622498,0.35246120861490399,0.36048705140388598,0.36893284238316498,0.37781843803570397,0.38714664106135299,0.39693761636894997,0.40722625972342502,0.41808973620289502,0.42954808791336602,0.44163285005594299,0.45449263013067998,0.46820128248160903,0.48252430846531902,0.49752234940019502,0.51344721317764896,0.53014113544936003,0.54795844061394805,0.56724213994552797,0.58822424052260103,0.610951882952952,0.63558296198865505,0.66203011320237104,0.69039591231444797,0.72067879549918901,0.75361223563340596,0.78870641519950002,0.82439878671906597,0.86271888775084105,0.90131448167374995,0.94003828141595902,0.97093175679496402,0.99047862937411701,0.99970169568245904,0.99999999999998002,0.999999999999999,0.99999999999998501,1.00000000000005,1.0000000000000899,0.99999999999996003,1]
[2.375,0.187773732714025,0.189921741676427,0.19211325314034799,0.19434952390118601,0.19663024895343401,0.19897192722901499,0.20137708041753699,0.20382827963119299,0.20633957070815601,0.208921408900653,0.21157707859928501,0.214309792891862,0.21711688025758799,0.22000341746876501,0.22297436277315699,0.22602133176086101,0.22915085434226201,0.232377153382477,0.23569666302682701,0.239105193598636,0.242627265269381,0.246247494210003,0.24997138519010201,0.25381559880238902,0.25779471852561398,0.26190082077967902,0.26614264883486399,0.27052784183017298,0.27506190645432199,0.27977368749058401,0.28467134337539302,0.28975439658544,0.29504248899376301,0.30052952349323397,0.30624854282652902,0.31220202156160698,0.31836750152167598,0.32478978434938799,0.33149358591904399,0.33849833271181201,0.34583670333372502,0.35353576773878898,0.36159124158155898,0.370067327403383,0.378977631358349,0.38833448722587899,0.39815364531354702,0.40851418067207401,0.419421014098665,0.43092640540814098,0.44305727631646602,0.45596973365317001,0.46963602921328301,0.48394788689413698,0.49892149317970802,0.51478064519375699,0.53145145989697096,0.54932573568931897,0.56863416539146805,0.58965318807056799,0.61232772362110799,0.636964129585322,0.663395034498933,0.69180309068535395,0.72227890046354604,0.755499432556898,0.79074755630640903,0.82646934227874003,0.86476931548778102,0.90327996832968005,0.94196828997033799,0.97216045663667405,0.99086717155012105,0.99984208758528703,0.99999999999998002,0.999999999999999,0.99999999999998501,1.00000000000005,1.0000000000000899,0.99999999999996003,1]
[2.4375,0.18839635642937999,0.190544393671054,0.19272923907268599,0.19496394142917101,0.197252853115573,0.199602833166282,0.20201649928761001,0.20447850791946201,0.206998282378028,0.20958920327514999,0.212254271422083,0.21498674144221999,0.21779926431649699,0.22068571125661801,0.22364959195921,0.226704309644779,0.229854697439137,0.23309133168763899,0.23641348856977901,0.239833171341688,0.243361870721433,0.24700060572928001,0.25073893335525799,0.25459707744374499,0.25857159599576901,0.26268060718588498,0.26693933998550201,0.27134152368915299,0.275896159060734,0.28062409376955899,0.28553831827895199,0.29063859207810899,0.29593851222976197,0.30145062953798502,0.30719042878602398,0.31316596843454497,0.319347501049636,0.32577487457334098,0.33247830699156999,0.33950504539995402,0.34686858383897001,0.35459410671841901,0.36267743158685101,0.37115497476259102,0.38006956840045097,0.38945762246904198,0.39933118672528201,0.40972786985273402,0.42066369015534699,0.43223176297819099,0.44441699610779001,0.45738699687235501,0.47099530733431699,0.48530289456282999,0.50021592780424295,0.51598931914461299,0.53273999789462401,0.55069303076469001,0.570018940090944,0.59100477897020598,0.613694686369889,0.63828343152739497,0.66474740637950303,0.69303220898534701,0.72385769666149302,0.75717853574748994,0.79269759070499002,0.82851042457985002,0.86665979796600801,0.90524545498561104,0.94369593616034597,0.97336158736697098,0.99123570029609698,0.99998247948811503,0.99999999999998002,0.999999999999999,0.99999999999998501,1.00000000000005,1.0000000000000899,0.99999999999996003,1]
[2.5,0.188967034390295,0.19110845677006699,0.19329817866594401,0.19554086902305101,0.197837978920617,0.200196389667639,0.202618425236998,0.20509176592905001,0.20762080324358401,0.21021805717139799,0.212882664534703,0.215623988496013,0.21842880845280699,0.221315329007166,0.224289078885923,0.22735451267327,0.23051612725044901,0.23376593718799399,0.23709990831411701,0.24052555982391299,0.24405802558784701,0.247709964510195,0.251479843437105,0.25532698764547002,0.25930594860928802,0.26342743382093797,0.26768835168622701,0.27211006062322601,0.27670058045021501,0.28146039905355602,0.28639411663980102,0.29149887173924,0.29681084341045999,0.30234924346439501,0.30810293658439097,0.31407595274994798,0.32028245911082498,0.32673020638571498,0.33345427274115302,0.34050543539991801,0.34789462200076898,0.355647112950428,0.363737943153495,0.37221332530860901,0.38113780994218699,0.39055866974796499,0.400470186955656,0.41089355069949901,0.42188524880320899,0.43349981889714201,0.44576007866838202,0.45870628778425399,0.47232500581390402,0.48660157305773999,0.50143764439201,0.51716861114777701,0.53398257136259397,0.55202280336270704,0.57138456392174897,0.59226830611491299,0.61500626719457396,0.63952606858905103,0.66598814124007399,0.69424618604377097,0.72538008675878796,0.75881644130045101,0.79455067246872302,0.83046536914394697,0.86854319467227203,0.90714182394519405,0.94533319074400601,0.97445990539758698,0.99160422904207401,0.99999999999998301,0.99999999999998002,0.999999999999999,0.99999999999998501,1.00000000000005,1.0000000000000899,0.99999999999996003,1]
[2.5625,0.189475042254202,0.191624156839132,0.19382176826335301,0.19607243020279,0.19837737826669299,0.20074391831830801,0.203174621537144,0.20566330198056901,0.20819831221189999,0.21079719872526001,0.21346302534005099,0.216194176002728,0.219005460677233,0.22190074480371,0.22488374971577299,0.22795856794199601,0.23112960808678701,0.234391544734394,0.237728465889881,0.24115695205270901,0.244699923243832,0.248362920504649,0.25212424347296197,0.25598824315485103,0.25997517483564703,0.26409586643790001,0.26836968051907101,0.27280484606905703,0.27741099785992701,0.28219784339435,0.28715577826906702,0.29228212809389897,0.29762120706358203,0.30316144086819402,0.30892130995586398,0.314928972074974,0.321138225544008,0.32762066092859099,0.33439160600638301,0.34146776136246998,0.34888299498940401,0.35664893830994798,0.36473524209964298,0.37322512283723602,0.38216242465279998,0.39161332256491899,0.40154019371310601,0.41198763057386201,0.42303455112629001,0.43471222802790299,0.44702761041650702,0.45994226958840501,0.47358724359424098,0.48782720537968599,0.502590742719629,0.51834790315094104,0.53521100053222903,0.55331128289820297,0.57271994272947702,0.59353183325962,0.61624662144369902,0.64071570525650501,0.66715598158996103,0.69546016310219505,0.72668520810219095,0.76042377662278005,0.79626416209440598,0.83221804615737405,0.87023336858747102,0.90892862999604096,0.94681246706431399,0.97543192912018395,0.99197275778805005,0.99999999999998301,0.99999999999998002,0.999999999999999,0.99999999999998501,1.00000000000005,1.0000000000000899,0.99999999999996003,1]
[2.625,0.189922179850435,0.192078078943757,0.194282354968284,0.19654351100714099,0.19885826394797801,0.20123222874595101,0.203670466656664,0.20616686175913099,0.208725604579518,0.21131726938561099,0.213979276372084,0.216718375857437,0.21953825314813999,0.22244252209307899,0.22543409855952001,0.22851761626831499,0.231697953525481,0.23496231844051599,0.23830218018556401,0.24174035888499401,0.24529013832553101,0.248933559402779,0.25270305116163799,0.25658938900741601,0.26057618620362699,0.26470767516704202,0.26899270116826202,0.27343922968184198,0.27805699034411102,0.28285595351217702,0.28783535820530798,0.29298782297717302,0.29833996738561003,0.30388408975310199,0.30966941846417501,0.31569305122369001,0.32192906835702001,0.32843384065402098,0.33524963551783299,0.34237682795600599,0.34981189097747001,0.35756899026662697,0.36566969948234301,0.37415865074070498,0.38312285592921902,0.39257422652423801,0.40250159816020198,0.41298841306108502,0.42406841253111499,0.43583384432704397,0.44812024787348897,0.46107899005984698,0.47472878793187701,0.48899120714884697,0.50372467733833504,0.51952719515410495,0.53640180363843504,0.55454234371149302,0.57393315523335797,0.59479536040432701,0.61742591344497599,0.64187488158565498,0.66821094952372095,0.69667414016062001,0.72791363726773195,0.76199616595362296,0.79787866899538096,0.83394675162094001,0.87184247230394996,0.91071543604688598,0.94828658205411698,0.97630547874221796,0.99234128653402698,0.99999999999998301,0.99999999999998002,0.999999999999999,0.99999999999998501,1.00000000000005,1.0000000000000899,0.99999999999996003,1]
[2.6875,0.19032418667673801,0.19248520793111801,0.19469498572027599,0.19696199971584,0.19928879665058699,0.201675905273243,0.204120630060216,0.20661896978081901,0.20917128553959,0.21178718375778399,0.21445595946406401,0.21720239348359799,0.22002976424673801,0.222941543991171,0.22594160422058801,0.229034355734204,0.232214246950462,0.235484274790939,0.23883408431054801,0.24227599727201801,0.24581028766400601,0.249464802053395,0.253245840256762,0.257136260767721,0.261151699340118,0.265294851594439,0.26959180848985398,0.27405051838598998,0.27868108537372299,0.28349381091069398,0.28848830194062602,0.29365654798885399,0.299023168070921,0.30458344513419,0.31037694913344799,0.316412710349736,0.32268853783775903,0.32923374802265198,0.33606858829992903,0.34323886193400599,0.35068690015283499,0.35845479106459399,0.36655739213106697,0.37507422877096003,0.38405405208582299,0.39349538972359799,0.403449210436502,0.41394937653311997,0.42508186659775199,0.43686894674353899,0.44916850743297498,0.46215115896583497,0.47579962692852601,0.49008453291446502,0.50485861195704096,0.52070648715726897,0.537589285169082,0.55573872690244297,0.57509176035903697,0.59602095941480804,0.618558650017345,0.64292836943145004,0.66924828970910699,0.697842842063786,0.72910806357943903,0.76354193356685696,0.79944952729644103,0.83556827936065903,0.87331658729768402,0.91245552130844898,0.94971549541838896,0.97717902836425197,0.99270981528000402,0.99999999999998301,0.99999999999998002,0.999999999999999,0.99999999999998501,1.00000000000005,1.0000000000000899,0.99999999999996003,1]
[2.75,0.19067897160121,0.192844836187721,0.195059733328071,0.197331910710694,0.199664108439217,0.20205871141877299,0.20450572500212499,0.20699827426227499,0.20955654288588399,0.212187238318296,0.21488231498975699,0.21763603767235601,0.22047036368105999,0.22338969184208901,0.226397715134113,0.22948767874395701,0.232671976771234,0.235951591459304,0.23930443753730399,0.24274382914329901,0.24628713050574999,0.249951105037301,0.25374177564994799,0.25765858225932797,0.26169389665399401,0.265857933679568,0.27016500180699499,0.27463439734490402,0.27927649066544802,0.28410127652998302,0.289102795738231,0.29426971970916999,0.299653317451057,0.30523827872887899,0.31103088886515601,0.31708164183092602,0.32338738098168301,0.32996760861189101,0.33684949516118001,0.344022520195716,0.35149741755441499,0.35929690426754501,0.36741336995700102,0.37595558812994301,0.38492032728469,0.39437670621896898,0.40433144696444001,0.414865243020901,0.426059277241496,0.43778755577249301,0.45018465135339703,0.46320167770521298,0.47683204603232998,0.49111741375750501,0.50599254657574699,0.52184804270587404,0.53877114423141004,0.55687509833484605,0.57620851414893803,0.59714519711334202,0.61968880485190303,0.64394425868031502,0.67028562989449403,0.69899901069085801,0.73027507128670199,0.76486449716147797,0.800977444330774,0.837155787817077,0.87479070229141898,0.91407380163455598,0.95109133607553997,0.97802732139005799,0.99307834402598105,0.99999999999998301,0.99999999999998002,0.999999999999999,0.99999999999998501,1.00000000000005,1.0000000000000899,0.99999999999996003,1]
[2.8125,0.191023744341627,0.19319385544717799,0.19541313805263399,0.197689844906836,0.200024279366702,0.20240575226912999,0.20485145243684899,0.20735569455472899,0.20992550192356199,0.21256116075572401,0.215272415741357,0.218045527440106,0.220890183290049,0.22381553698058701,0.22681769990835601,0.229911764413259,0.233102918104756,0.23639035990224899,0.23974930560447,0.24319599012957899,0.24674677535929301,0.25041832815658499,0.254217044072299,0.25814314346652301,0.26220113611448198,0.26639274772496802,0.27071335671830898,0.27519440420563801,0.27984859865449402,0.28467885878587701,0.28968108882990901,0.29486112225226402,0.300255246608226,0.30584659757136201,0.31167166753680098,0.31773680405677002,0.32405743325805902,0.330672435357171,0.337562026483335,0.34474160068724602,0.35223976832904302,0.36007700843882001,0.36824094329436602,0.376775664060994,0.38573928006626701,0.39521905765134102,0.40519857343882398,0.41575864605498702,0.42691927971945498,0.43865077574456202,0.45110114984996302,0.46422475480881997,0.477789956157741,0.49213655499529002,0.50710687338356097,0.52298802497560004,0.53991767812306901,0.55794329761247996,0.57731656688792499,0.59819022169359104,0.62076429933324495,0.64490069721184196,0.67132297007987995,0.70009755398223295,0.73144096387941704,0.76610930538172906,0.80232710193899004,0.83862863460002401,0.87626481728515304,0.91543802009531305,0.95240877371645505,0.97879167730933803,0.99344687277195698,0.99999999999998301,0.99999999999998002,0.999999999999999,0.99999999999998501,1.00000000000005,1.0000000000000899,0.99999999999996003,1]
[2.875,0.19135047056906199,0.19352872739959201,0.195757094147926,0.19802873274379901,0.20035196167989899,0.20273747663016101,0.20518775342743101,0.207696572962869,0.210273674739587,0.212923734938299,0.21564190571593,0.21843533624623601,0.221291816599478,0.224218279624079,0.22722562336966201,0.230325782843912,0.23352308018998399,0.23681830707353299,0.240184267185379,0.24363808374929999,0.24719619633936099,0.25087548417403099,0.25468220185255003,0.25861687129732602,0.26268286391488299,0.26689730321307797,0.271249281153639,0.27574052253583198,0.28039734897492402,0.28522712865215399,0.29024076682751898,0.29543183213323598,0.30081774366062503,0.30643366297153402,0.31228028697817301,0.31837862888760299,0.32471636803284099,0.33133625036593201,0.33823060612162098,0.34542919468462502,0.35294072262023102,0.36079611402525902,0.36900400565388503,0.37755153600674302,0.386546188396237,0.39604921896853301,0.40605335556601002,0.41662133285681102,0.42770932012009,0.43946993118188699,0.451939877270849,0.46514834146971501,0.47873760151807598,0.493130851078314,0.50816521236101997,0.52412800724532504,0.54103876126530503,0.55901149689011398,0.57837099392647595,0.59917296502836304,0.62171465284554095,0.64583171721245802,0.67235158423086805,0.70119591417795102,0.73254655012840297,0.76735411360198003,0.80361197015180896,0.83996481812467905,0.877738932278888,0.91677812463344699,0.95358806570829802,0.97954361224742903,0.99381540151793402,0.99999999999998301,0.99999999999998002,0.999999999999999,0.99999999999998501,1.00000000000005,1.0000000000000899,0.99999999999996003,1]
[2.9375,0.191659808637267,0.19383982202401401,0.19606115130301599,0.19833717950469401,0.20066510391718301,0.20305490708241999,0.20550942499628699,0.20802269827216399,0.21060453928608,0.213259472221631,0.21599061486865501,0.218796235753494,0.22165820636634001,0.22459336191757101,0.22761745137780801,0.230724183970103,0.23392800666862401,0.237231009946301,0.24060378293769699,0.244064728321191,0.247630306221269,0.251317331770951,0.255131934290664,0.25907465155396497,0.26314904317496901,0.26737237415210902,0.27175262621010399,0.27626186418379101,0.28091868667522901,0.28575878125568399,0.29078314693040103,0.29596532160607403,0.301362445880064,0.30699005507572602,0.312863738691388,0.31898179815345601,0.32534689865333899,0.33195118419960401,0.33885481026171099,0.346072615387708,0.35359863897510202,0.36149280508021298,0.36967534564056398,0.37826787692402503,0.38730354153755803,0.39684018120728898,0.40687990804083302,0.41740269118055801,0.42846731317219,0.44022325901467602,0.45271327000953099,0.46594217151561801,0.47965755399554599,0.494101392943115,0.50920975570063598,0.52519394506265105,0.54207851275675101,0.56006816577002405,0.57934195154203705,0.60014144234899602,0.62260380370027002,0.64675927284173196,0.67333432756439204,0.70227031064675505,0.73362022791403703,0.76854935275506198,0.80479266900580904,0.84114660647817197,0.87921304727262195,0.91811822917158203,0.95465568585587901,0.98019877446395498,0.99418393026391105,0.99999999999998301,0.99999999999998002,0.999999999999999,0.99999999999998501,1.00000000000005,1.0000000000000899,0.99999999999996003,1]
[3,0.191948335657326,0.194116720852131,0.196338752031367,0.19861838543730301,0.20095807972449001,0.20335631970625001,0.20581487225065401,0.20833232973548499,0.21091847118638199,0.213577825697984,0.21631351625180201,0.219124523460865,0.22200054872209801,0.22494551954912401,0.22797481259230901,0.231097886250755,0.234311890785734,0.23762179229119701,0.24100083678418299,0.24446829124711,0.24804059519593499,0.251734405129317,0.25555593085113498,0.259505964451343,0.26358805808834901,0.26781928514245801,0.27219854044527197,0.276735795259543,0.28141125286083801,0.286261418525739,0.291279020513391,0.29646929761348001,0.30187738990457103,0.30751643936303502,0.31340206064422799,0.31954998225698,0.32589962057574701,0.33252300554911901,0.33943761765187203,0.34666183211595197,0.35422180219865002,0.36210381363604099,0.37030696572206701,0.37891752283527003,0.388010723274126,0.39758513930649902,0.407611865062594,0.41808615224922802,0.42918621475351898,0.440952391168073,0.45341626825873299,0.46668770094356399,0.48053500340326299,0.495004456418495,0.51019249903684805,0.52620106853974802,0.54306125609245903,0.56109188835761004,0.58028002472555396,0.60105964437776005,0.62342237904790598,0.64763856950898102,0.67431707089791604,0.70331086241111795,0.73466439270474604,0.76967629741544497,0.80591580424126996,0.84227483230862199,0.88056937994686302,0.91945833370971597,0.95563842918241504,0.98085393668048004,0.99455245900988698,0.99999999999998301,0.99999999999998002,0.999999999999999,0.99999999999998501,1.00000000000005,1.0000000000000899,0.99999999999996003,1]
[3.0625,0.19221899636748199,0.194390807647219,0.19661629636009401,0.198899284491594,0.20124255805980801,0.203648658279655,0.206120119443612,0.20864196119880599,0.21123240308668401,0.21389617917433601,0.21663641763494901,0.219452492216129,0.222332950767264,0.22529754701416699,0.22833217380680901,0.23146074533007999,0.23468766424288701,0.238012543695691,0.24139789063066799,0.24487185417302901,0.24845067130533799,0.25215117207141302,0.255979807319268,0.25993727734872102,0.26402693398448601,0.26825572602613001,0.27263531526276003,0.277180811111298,0.28189704388994002,0.28674809580602301,0.29177039218294798,0.29697069727626102,0.302389235393625,0.30803917518160701,0.31393616028490301,0.32007600301987299,0.32643566239684901,0.333071449368192,0.339992229473767,0.347237096509176,0.35481071383264901,0.36268338022012497,0.37090391120935201,0.37955497797343801,0.38866588549938702,0.39829512994741501,0.40828087452469197,0.41874131447422402,0.42986185079794498,0.441624729026733,0.45409152848228201,0.46740706142824501,0.48133735918804099,0.495878006050882,0.51111757606790698,0.52714239790464201,0.54400965982577898,0.56202272515251905,0.58121809790906998,0.60194879310922,0.62420857371542404,0.64848450214665598,0.67527984382276796,0.70435006196134597,0.73570855749545505,0.77072455696933995,0.80703893947673,0.84333317127956897,0.88180166384914205,0.92064657231352398,0.95662117250894996,0.98150909889700599,0.99492098775586402,0.99999999999998301,0.99999999999998002,0.999999999999999,0.99999999999998501,1.00000000000005,1.0000000000000899,0.99999999999996003,1]
[3.125,0.192488306053299,0.19466470906363401,0.196893499783765,0.19918006830308499,0.20152703639512601,0.20393692965943599,0.206412286382571,0.20894700843459199,0.211546334986986,0.21421453265068899,0.21695931901809601,0.21978007332945601,0.22266534924989301,0.22563716827498201,0.22868953502131001,0.231823604409406,0.235056192995313,0.238391229479547,0.24179461405720001,0.245275151182307,0.24886044961633799,0.25256786419264798,0.25640368378740103,0.26036842331258903,0.26445461823781102,0.26868455948332298,0.27307209008024802,0.27762582696305399,0.28234402360987698,0.28722356365374102,0.29226176385250502,0.29747209693904197,0.30290108088267897,0.30856191100017799,0.314456632793015,0.320600132800548,0.32697170421795002,0.333597102781863,0.34053039844485899,0.34780429836051702,0.35535531233349099,0.36325438133746002,0.371498729545583,0.38016737886740998,0.38932104772464898,0.39892158135363598,0.40890854238006202,0.41939647669921998,0.43053296735160801,0.44226994906638301,0.454746690706961,0.46808607991572998,0.48204639478800398,0.49674084379302502,0.51198597532873902,0.52802727479046097,0.54495145552249902,0.56292001254573198,0.58214429952881996,0.60281332370041296,0.62499476838294199,0.64931207548053804,0.67620799030443002,0.70529715131377602,0.73675272228616395,0.77177281652323604,0.80802527083915998,0.84439151025051395,0.88294819773315802,0.92170675743058605,0.95760391583548599,0.98216426111353095,0.99528951650184105,0.99999999999998301,0.99999999999998002,0.999999999999999,0.99999999999998501,1.00000000000005,1.0000000000000899,0.99999999999996003,1]
[3.1875,0.19273420337156899,0.19493115356499199,0.19716951308508401,0.19946085211457601,0.20181151473044501,0.20422520103921701,0.20670445332153001,0.20924317766037701,0.21185117671677201,0.21453288612704099,0.21728222040124401,0.22010765444278299,0.22299774773252201,0.22597452792898201,0.22904187444357399,0.23218646348873201,0.23542472174773901,0.23876605445006399,0.24217550284971301,0.24567393571334101,0.249270196868905,0.252984556313883,0.25682736636838699,0.260787658185755,0.264875793954719,0.26911339294051601,0.27350886489773601,0.27806201286920601,0.282778698548385,0.287681038221337,0.29274616391152802,0.29797349660182298,0.303412926371733,0.30907707011351099,0.314969368448063,0.32112426258122301,0.32749417894683602,0.334122756195535,0.34106856741595099,0.34832261947256099,0.35588704359808998,0.36380874937440899,0.372090243979598,0.38077827337482201,0.38993374371070799,0.39950470891840201,0.40948662669631802,0.42004413241780503,0.431177892666741,0.44290397702585899,0.45540185293163998,0.46875980385335603,0.48271325633786999,0.49751304159913401,0.51281102153243496,0.52887199445827604,0.54585653170403903,0.56377466227759299,0.583011200655976,0.60363319918256497,0.62578096305046005,0.65013964881441899,0.67709983352738301,0.70612853543311305,0.73779688707687396,0.77282107607713202,0.80897922073959505,0.84544984922146005,0.88405826484384498,0.92268950075855105,0.95851660327695498,0.98281942333005701,0.99565804524781798,0.99999999999998301,0.99999999999998002,0.999999999999999,0.99999999999998501,1.00000000000005,1.0000000000000899,0.99999999999996003,1]
[3.25,0.192979889206642,0.19517994934733801,0.19743409783053401,0.19973341198726499,0.202093463070945,0.204513472418999,0.20699662026048901,0.20953934688616199,0.212151459404017,0.214837521914995,0.21760068489496101,0.22043523555611,0.22333014621515199,0.22631188758298201,0.22938434560747101,0.23254932256805699,0.235793250500165,0.239140432865212,0.24255618174997701,0.24606085525129801,0.249671625679008,0.25340102850801699,0.25723844321932998,0.261201444855019,0.26529696967162703,0.26954222639770897,0.27393940631057001,0.27848848639380402,0.28321337348689302,0.28812423619782901,0.29321788071430299,0.29846719771355801,0.30392298472189699,0.30957889649933901,0.31548210410311001,0.32164375817316798,0.32800788569205902,0.334648409609206,0.34159587364494798,0.34882597581663199,0.35640298385071301,0.36435492418262899,0.37265920064903701,0.38138916788223298,0.39049749466512301,0.40003850280668202,0.41006439987443999,0.42063629888978998,0.43179160199287497,0.44353800498533502,0.45605701515631902,0.46940367017749102,0.48338011788773499,0.49819054200148499,0.51358432314166902,0.52969749886049,0.54667017059370304,0.56461839851842199,0.58385299286688297,0.60438195600905797,0.626567157717979,0.65096722214830005,0.67791878630531999,0.70693785347206295,0.73884105186758298,0.77381559247546094,0.80985838586909198,0.84650818819240703,0.88512290345042999,0.92367224408651605,0.95930279793818296,0.983275258553304,0.99602657399379502,0.99999999999998301,0.99999999999998002,0.999999999999999,0.99999999999998501,1.00000000000005,1.0000000000000899,0.99999999999996003,1]
[3.3125,0.19322007863993701,0.195428745129685,0.197686459557088,0.20000143289823399,0.20236501057283901,0.20479196013362999,0.20728483743208401,0.20983551611194701,0.212451742091262,0.21514203393585399,0.21790954708753599,0.22075369374748299,0.22366254469778099,0.22664924723698199,0.229726816771368,0.23289965853044001,0.23616177925259099,0.23951481128036001,0.242936860650241,0.246447771764259,0.25006474877685803,0.25379170299079901,0.25764509563569499,0.26161523152428201,0.265718145388535,0.26996732749089702,0.27435798217732899,0.27891495991840298,0.28364804842540098,0.28856743417432001,0.29367428897406,0.29894854138982702,0.30440590427734898,0.31008072288516703,0.31599483975815801,0.32214604921298201,0.32852159243728102,0.335174063022877,0.342087874044193,0.349329332160703,0.35691892410333498,0.36488409367244401,0.37322070858254602,0.38194537723993899,0.39103638912516198,0.40057199204718402,0.41061357997488301,0.42120118815731,0.43235788249673401,0.44416342150607402,0.45670714911288202,0.47004753650162601,0.48403703482909399,0.49881298534330698,0.51433003546908496,0.53052300326270496,0.54743483815192295,0.56543022996942305,0.58463452914705705,0.60513071283555098,0.62735335238549705,0.651794795482181,0.678687451735421,0.70774524904293601,0.73982650013061002,0.774798335807238,0.81068175391799902,0.84751994306450495,0.88615436011585502,0.92458325160406796,0.96008899259941205,0.98360283966156703,0.99639510273977105,0.99999999999998301,0.99999999999998002,0.999999999999999,0.99999999999998501,1.00000000000005,1.0000000000000899,0.99999999999996003,1]
[3.375,0.19344119589150299,0.195657030834332,0.197927737937829,0.20025681457546701,0.20263655807473399,0.20506712826887599,0.207563724055636,0.21012027014849499,0.21274658949490399,0.215446545956713,0.21821840928011199,0.22106703220370799,0.223981007270184,0.226982388326184,0.23006928793526399,0.233247398481461,0.23652541598531401,0.23988918969550799,0.24331750866713101,0.246834424881511,0.25044394632991401,0.25417480632657302,0.25803488349579701,0.26202491820770002,0.26613800229531098,0.27037829288737403,0.27477655804408802,0.279341433443002,0.284082723363909,0.28901063215081102,0.29412635091005301,0.29940761390847498,0.30487680212727802,0.31057331333891303,0.316490131960038,0.32264834025279499,0.32903529918250302,0.33566550320600003,0.34257924571345,0.349832688504774,0.357434864355958,0.36541326316225903,0.373755701803691,0.38244829375843198,0.39153588706435599,0.40110548128768603,0.41114894686915499,0.42171156992560199,0.43290913029464201,0.44475571216342302,0.45732041284341302,0.470691402825761,0.48466879840265098,0.49943174966624798,0.51504819406093205,0.531281333722468,0.54817189565370505,0.56617580253737998,0.58536497216475103,0.60586490808902305,0.628139547053014,0.65262236881606195,0.67942977375936897,0.70849675865053197,0.74074782200476497,0.775739247200389,0.81145390939237805,0.848485145249119,0.88710902889669996,0.92538731432694898,0.96087518726064003,0.98393042076982995,0.99665958623878903,0.99999999999998301,0.99999999999998002,0.999999999999999,0.99999999999998501,1.00000000000005,1.0000000000000899,0.99999999999996003,1]
[3.4375,0.193662313143069,0.195880947038443,0.19815452486249999,0.200487082472731,0.20288127838140099,0.20533641445331,0.20784261067918799,0.210402977136745,0.21303322296909299,0.21573793162458299,0.21852027546251299,0.22137968851655801,0.22429895364487201,0.22730508016914,0.23040269779075201,0.233595138432481,0.236878589373055,0.240263568110656,0.24369792544379801,0.247206521976058,0.25082066461010899,0.25455790966234698,0.25842459206148,0.26242146376574499,0.26653322759508202,0.27078925828384998,0.27519513391084699,0.27976790696760101,0.28451739830241701,0.28945383012730302,0.29456781721568598,0.29984884561172198,0.30534769997720801,0.31104542402277902,0.31697145390946202,0.32315063129260901,0.329536609977581,0.33614544762717802,0.343070617382708,0.35033604484884601,0.35795080460858097,0.36594243265207399,0.37425565261149801,0.38292638511205801,0.39202725873330202,0.40162552224341802,0.41166922275378498,0.422217831644917,0.43343121269260698,0.44531961132780801,0.45790777424073698,0.47132323744597399,0.485277446111053,0.50005051398918898,0.51571852958527398,0.53195884257606596,0.54890272109020599,0.56689887197813005,0.58601926467069299,0.60656686761386003,0.62892574172053295,0.65344994214994301,0.68013953283358097,0.70924826825812803,0.74166914387892002,0.77653125626489305,0.81222606486675697,0.84939229293850205,0.88800987694842604,0.92619137704983001,0.96158084541813604,0.98425800187809298,0.99690527206944002,0.99999999999998301,0.99999999999998002,0.999999999999999,0.99999999999998501,1.00000000000005,1.0000000000000899,0.99999999999996003,1]
[3.5,0.19388343039463499,0.19610486324255499,0.198381311787172,0.20071681468213201,0.203114033383025,0.205575539840544,0.208099634298022,0.21067435762307499,0.21331681995981,0.21602860218994899,0.21881509846451799,0.221678784315683,0.22460826801816999,0.22762562229955499,0.23073027890404499,0.23392884839605399,0.23722796485983599,0.24062512599931399,0.24406315112688501,0.24757706454675801,0.25119738289030402,0.254941012998121,0.25881430062716299,0.262801771828718,0.26691930533558,0.27118738089540401,0.27561370977760602,0.28019438049220002,0.28495207324092497,0.289891899836906,0.29500022428489697,0.30029007731496898,0.30580137463728602,0.31150543154312099,0.31744146159325498,0.32364202859957902,0.33000564657104497,0.33662539204835601,0.343561989051966,0.35083940119291701,0.358466744861203,0.36645457789973601,0.37472116261376598,0.38340447646568498,0.39251863040224799,0.40211287061052697,0.41215460157890599,0.422724093364233,0.43395329509057101,0.445826833695388,0.45846184805868401,0.47189932836756898,0.48587411170830103,0.50066927831213004,0.51635989284657702,0.53262710804452496,0.54959793142304303,0.56756192249181003,0.58664464679303696,0.60726882713869701,0.62968904340274801,0.65422610147316695,0.68084929190779298,0.70999977786572399,0.74251294138060797,0.77731745093031401,0.812998220341136,0.85023568542947503,0.888910725000153,0.92699543977271004,0.96226876574671105,0.98458558298635601,0.99715095790009101,0.99999999999998301,0.99999999999998002,0.999999999999999,0.99999999999998501,1.00000000000005,1.0000000000000899,0.99999999999996003,1]
[3.5625,0.194104547646201,0.19632877944666699,0.19860809871184301,0.20094654689153299,0.20334678838464901,0.205811398242183,0.20834297370967,0.210930140136253,0.213578702570492,0.21630225199157299,0.21910328213538,0.22197648496901801,0.22491176228491799,0.22793364633146801,0.231047503097424,0.23425777602070999,0.23756473655013999,0.24095947582473801,0.24442299322828701,0.247947607117458,0.251574101170499,0.25532411633389501,0.25919031077793198,0.26318107627554299,0.26730538307607898,0.27158047823116399,0.27601485149449201,0.28061721377489801,0.28538674817943299,0.29031582833615899,0.29543263135410702,0.30073130901821699,0.30623132484809201,0.311958494089211,0.317911469277049,0.32408725638277402,0.33046291624345198,0.337105336469534,0.344053360721224,0.35134275753698802,0.35898175311751102,0.36692507229030902,0.375186672616034,0.38388256781931102,0.39301000207119402,0.40258804918597901,0.41261706903190998,0.423230355083548,0.43447537748853599,0.446334056062969,0.45898597783842698,0.47242996452371899,0.48644961149005,0.50128804263507099,0.51694041004879998,0.53329537351298495,0.55022131811534503,0.56818735053941805,0.58727002891538105,0.60792639519945202,0.63042610090354601,0.65500195147368101,0.68155905098200498,0.71075128747331995,0.74324999887993204,0.77803900348066002,0.81377037581551603,0.85103291737172904,0.88981157305187997,0.92779515124166501,0.96295441597550602,0.98491316409461904,0.99739664373074199,0.99999999999998301,0.99999999999998002,0.999999999999999,0.99999999999998501,1.00000000000005,1.0000000000000899,0.99999999999996003,1]
[3.625,0.19432566489776701,0.19655269565077901,0.198834885636515,0.201176279100935,0.20357954338627299,0.20604725664382201,0.208582019387,0.21117781800480101,0.21383803761856701,0.21656523964595101,0.219370730890531,0.22225397347901399,0.22520360016497901,0.228236580236367,0.231360194160112,0.23457341778107199,0.23787502408878,0.241282058257102,0.24475768665181299,0.24831488110119199,0.25195081945069298,0.25569596881134599,0.259563075492933,0.26356038072236798,0.26769146081657802,0.27197357556692398,0.27641522841052202,0.28102514497233999,0.28579444450179198,0.29073975683541098,0.29586503842331802,0.30115989019663097,0.30666127505889701,0.31239759217681101,0.31836716304289803,0.324524031200003,0.330909617761037,0.33757260673145001,0.344544732390482,0.35184611388105902,0.35947297378710302,0.36737864613872101,0.37565218261830202,0.38436065917293699,0.39347929410416099,0.403037303283244,0.41307953648491502,0.42370697622889397,0.43496921447263098,0.44684127843054899,0.45948204231046702,0.472904392341503,0.48698733207436101,0.50190680695801204,0.517507377358153,0.533944142751963,0.55083553270016195,0.56874964792641503,0.58789541103772502,0.60858155742263298,0.63113653307912398,0.65570288853946102,0.68226881005621698,0.71150279708091602,0.74394628800529405,0.77867936000778304,0.814473624449915,0.85173944493873299,0.89066646658958004,0.92850987366200299,0.96354406197142695,0.98524074520288096,0.99762627669331605,0.99999999999998301,0.99999999999998002,0.999999999999999,0.99999999999998501,1.00000000000005,1.0000000000000899,0.99999999999996003,1]
[3.6875,0.19454678214933299,0.19677661185489101,0.19906167256118601,0.201406011310336,0.203812298387897,0.20628311504546101,0.20882106506433001,0.21142013828044301,0.214090186947961,0.216828227300329,0.21963747551139201,0.22252458396393701,0.225478190215846,0.228520402168122,0.231652565321496,0.23486680678128,0.23817878331259101,0.241594040269726,0.24507733995754999,0.248651600208118,0.25231012247060097,0.25606241548034703,0.25993584020793498,0.26393968516919197,0.268077538557077,0.27236667290268501,0.27681560532655303,0.28141970932499399,0.28619132161956001,0.291150751809649,0.29629280984816497,0.30158106591336697,0.30709122526970201,0.31283669026441102,0.318776326975452,0.32496080601723198,0.33135631927862103,0.338029696656381,0.34502248799469398,0.35233987613733703,0.35991563860602599,0.367832219987134,0.37611769262056999,0.38483875052656302,0.39393837617256799,0.40348655738050898,0.41354200393791901,0.42418345784707301,0.435437533354601,0.44734850079812999,0.459967583544998,0.47337882015928601,0.48747870374268298,0.50249059800087204,0.51807434466750701,0.53450290014729196,0.55143081612346501,0.569305111550785,0.58849534033906503,0.60923671964581405,0.63182445341320204,0.65637529187323895,0.68297856913042798,0.71225430668851197,0.74456526627317698,0.77926900600684901,0.81509302628828595,0.85241980570577003,0.89143862082776903,0.92922459608234098,0.96413370796734799,0.98556832631114399,0.99774911960864099,0.99999999999998301,0.99999999999998002,0.999999999999999,0.99999999999998501,1.00000000000005,1.0000000000000899,0.99999999999996003,1]
[3.75,0.194767899400899,0.19700052805900301,0.19928845948585799,0.20163574351973801,0.204045053389521,0.20651897344709999,0.20906011074166,0.21166245855608501,0.214335872782979,0.21708498787150801,0.219904220132253,0.22279519444885901,0.225752780266714,0.22879568257232,0.231920586232371,0.23514226357339299,0.238465225026532,0.24189290173063899,0.24538700077221201,0.24896582273387,0.252636638566205,0.25641043555807302,0.260305980185564,0.26431898961601702,0.26846361629757498,0.272759770238445,0.27720781457365601,0.28180909819527999,0.28658819873732799,0.29155541083166198,0.296687705563635,0.30199932019003101,0.307521175480507,0.31323967485985899,0.31918224270236401,0.32538966129345998,0.33180302079620499,0.33848678658131298,0.34549046101303399,0.35279012488371603,0.360357873108273,0.36828579383554599,0.37658320262283801,0.38529096510349098,0.39437515098940801,0.40393581147777402,0.414004471390924,0.42465993946525199,0.43589819429398102,0.44781940676563398,0.460426197102273,0.47385324797707001,0.48797007541100401,0.50293771531082299,0.51863593700523303,0.53501392668199599,0.55200408306929405,0.56983951514639497,0.58907605230981297,0.60989188186899501,0.63251237374727998,0.657047695207017,0.68364789291828398,0.71299969613594405,0.74517948085594599,0.77985865200591498,0.81565459390601602,0.85304499964769698,0.89217567832463596,0.92993931850267897,0.96469823073945904,0.98589590741940802,0.99787196252396704,0.99999999999998301,0.99999999999998002,0.999999999999999,0.99999999999998501,1.00000000000005,1.0000000000000899,0.99999999999996003,1]
[3.8125,0.19498901665246501,0.197224444263114,0.19951524641052901,0.20186547572913899,0.20427780839114501,0.206754831848739,0.20929915641899,0.21190477883172801,0.21458155861799799,0.21733413407039301,0.22016573383796201,0.223065804933781,0.22602322297803201,0.229059703171103,0.23218860714324699,0.23541440788288701,0.23874162159085099,0.24217508790169301,0.24567625927565201,0.24925520303906501,0.252936237114052,0.25673806214286399,0.26064921085238102,0.26468641455307201,0.26884969403807402,0.27314969408196699,0.277589992538958,0.28219848706556599,0.28698507585509597,0.29194386028264702,0.29708080289928102,0.302400439920256,0.30792722927189697,0.31363695408197301,0.31958815842927601,0.32580459736982698,0.33224972231378902,0.33894387650624402,0.34594059701457103,0.35319760382891602,0.36078447376395301,0.36873936768395899,0.37704509993302798,0.38573481833023698,0.39481192580624902,0.40438506557503801,0.41446693884392799,0.42513357751973502,0.43635885523336199,0.44826322633726601,0.46087638109755802,0.47432767579485302,0.48846021209171903,0.50337449012701696,0.51912730867333901,0.53551997570391696,0.552513320507655,0.57035225079965901,0.58965676428056102,0.61051142020253302,0.63318635581916505,0.65772009854079505,0.68430305514063305,0.71369339731218595,0.74579369543871599,0.78043303147672605,0.81612142044140201,0.85364976477395205,0.89291273582150199,0.93065404092301696,0.965189602402727,0.98622348852766994,0.99799480543929198,0.99999999999998301,0.99999999999998002,0.999999999999999,0.99999999999998501,1.00000000000005,1.0000000000000899,0.99999999999996003,1]
[3.875,0.195210133904031,0.197448360467226,0.19974203333520099,0.20209520793853999,0.20451056339276899,0.206990690250378,0.20953820209631899,0.21214709910737001,0.21482724445301701,0.21758328026927701,0.220418439268251,0.22332735085935901,0.22628336092095899,0.229323723769885,0.23245662805412201,0.23568655219238099,0.23901801815516999,0.242453618851144,0.245945721159124,0.24952908233045201,0.25322121448641899,0.25703914847372,0.26097194866567203,0.26502133598441202,0.26920638290395499,0.27352013884348397,0.27797217050425899,0.282587875935851,0.28737350458553101,0.29232924982742198,0.29747390023492598,0.30280155965048,0.30829575802401599,0.314021274199484,0.31999407415618902,0.32621953344619498,0.33267685262624602,0.33939813000237801,0.34635652625326202,0.35360508277411601,0.36120213968274201,0.36917622667904898,0.37748474826850298,0.38615978842234899,0.39524870062308898,0.40483431967230299,0.41492940629693198,0.42558027903677798,0.436807323860193,0.44867733705072199,0.46130223654359898,0.474802038535169,0.48890741262994902,0.50381126494321005,0.519601595159777,0.53594566652472897,0.55299938814310801,0.57086498645292305,0.59023747625130896,0.61111978512405796,0.63382513898652304,0.65839250187457299,0.68495821736298201,0.71433657699938302,0.74636820351635202,0.78095716125367298,0.81654259615470004,0.85421774156740204,0.893592575745081,0.93136876334335506,0.96568097406599496,0.98655106963593298,0.99811764835461803,0.99999999999998301,0.99999999999998002,0.999999999999999,0.99999999999998501,1.00000000000005,1.0000000000000899,0.99999999999996003,1]
[3.9375,0.19543125115559701,0.19767227667133799,0.199968820259872,0.202324940147941,0.204743318394393,0.20722654865201601,0.20977724777364901,0.21238941938301201,0.21507293028803501,0.21783242646816101,0.22066558206262599,0.22356947603007901,0.226540369437426,0.229587744368667,0.23272464896499701,0.23595869650187401,0.23929422934772501,0.242718803561874,0.24621518304259599,0.24980296162183799,0.25349965843264999,0.25732231180885701,0.26127751882517097,0.26534392431596898,0.26952390532075199,0.273845027613491,0.278327217992691,0.28297319660141301,0.287751482792929,0.29271463937219699,0.297866997570572,0.30316573925279899,0.308664286776134,0.314397643988855,0.32038169673507899,0.32663246285889302,0.33310121906795098,0.33982296291531999,0.34675430331885099,0.354012561719316,0.36161980560153101,0.36959691125730998,0.37789631984647398,0.386584758514461,0.39568547543992899,0.40528357376956697,0.41539187374993602,0.42602698055381999,0.43723727407028201,0.44908945522438098,0.46172809198963999,0.47524257865168201,0.48932858834565301,0.50424803975940402,0.52004793962237805,0.53633876385911605,0.55338964282123304,0.57137212781817204,0.59080913490945597,0.61172815004558301,0.63441720714894301,0.65906490520835104,0.68561337958532997,0.71495019644382996,0.74687042312561902,0.78148129103062003,0.81696377186799696,0.85468365721345796,0.89424773796451795,0.93208348576369304,0.96617234572926203,0.98687865074419601,0.99824049126994296,0.99999999999998301,0.99999999999998002,0.999999999999999,0.99999999999998501,1.00000000000005,1.0000000000000899,0.99999999999996003,1]
[4,0.19564246633198201,0.19789047079559499,0.200194175589271,0.20255467235734201,0.20497607339601701,0.20746240705365501,0.210016293450979,0.21263173965865401,0.215318616123054,0.21807533228357701,0.22090424830234301,0.22381160120079799,0.226786055272412,0.22984974845912201,0.232992669875872,0.236230840811369,0.23955527054736001,0.24298398827260401,0.246484644926068,0.25007684091322502,0.25377810237887999,0.25760547514399401,0.26156556428676297,0.26564330695292898,0.26982483471625102,0.27415926989227601,0.27865479910580598,0.28329345297449698,0.28810495132341302,0.29309331262878402,0.298242416598059,0.30352674701000099,0.30903281552825301,0.314774013778226,0.32076624847636398,0.32702556019439899,0.333507432489003,0.340192734741674,0.34715208038444001,0.35442004066451599,0.36203747152032101,0.37000008801145401,0.37828424484836298,0.38699071498346999,0.396122250256769,0.40573282786683201,0.41585434120294001,0.42646912641530599,0.437645893070646,0.44950157339803898,0.46215394743568,0.47568311876819402,0.48974976406135701,0.504684814575596,0.52046371564923599,0.53671181053399597,0.55371722393313405,0.57183648170675405,0.59133944815181705,0.61233651496710695,0.63500685314958005,0.65972276642713701,0.68626854180767904,0.71552828075736397,0.74736179479183396,0.78199754790144205,0.81738494758129399,0.85506163541736702,0.89490290018395502,0.93279820818403103,0.96666371739252999,0.98720623185245804,0.99836333418526901,0.99999999999998301,0.99999999999998002,0.999999999999999,0.99999999999998501,1.00000000000005,1.0000000000000899,0.99999999999996003,1]
[4.0625,0.19584312668384099,0.19810194721058999,0.20040836324035,0.20277461595840099,0.205203401824954,0.20769731846949699,0.21025533912830899,0.21287405993429601,0.21555740265337001,0.21831063702696801,0.22114291454206,0.22405372637151799,0.22703174110739899,0.23009910124686,0.23325983805856401,0.23648968449256699,0.239816311746995,0.24324917298333301,0.24675410680954099,0.25035072020461102,0.25405654632511099,0.25788863847913202,0.26184743121190601,0.26592434701696599,0.27012316751572701,0.27446302692445401,0.27895266598662599,0.28359922003687799,0.28842537057710299,0.29343231927313601,0.29856800084312801,0.303877088944704,0.30939833381297799,0.315150383567596,0.32115080021764902,0.32741865752990401,0.33387680978422202,0.34054588955931098,0.34752879171886097,0.35482751960971598,0.36244357258669901,0.37039058768344302,0.37867216985025298,0.38738912444482498,0.39653879645488199,0.406182081964096,0.416308960664309,0.42688604783121198,0.43804513255144201,0.44991369157169803,0.46257980288172001,0.47610446753470997,0.49017093977706,0.50509755408967305,0.52085778237693303,0.53706559813494403,0.55404480504503595,0.57226376141780699,0.59183081981937202,0.61290542894649602,0.63559649915021799,0.66029172309417905,0.68688264427544499,0.71610636507089798,0.747853166458048,0.78245616145626995,0.81779787058197195,0.85543961362127496,0.895542384515845,0.93351293060436802,0.96715508905579695,0.98753381296072096,0.99848617710059495,0.99999999999998301,0.99999999999998002,0.999999999999999,0.99999999999998501,1.00000000000005,1.0000000000000899,0.99999999999996003,1]
[4.125,0.19603967535189901,0.198305601484904,0.200622550891428,0.20299158526728001,0.20542322599315399,0.2079200736266,0.210484760306059,0.21310376499478201,0.21578904320407899,0.21854594177035899,0.221381580781778,0.224295851542238,0.22727742694238501,0.230348454034599,0.23350184051662801,0.236746709673756,0.24007735294662899,0.24351435769406299,0.24702356869301301,0.25062459949599702,0.25433499027134099,0.25817024457458598,0.262118532822815,0.26620020479647499,0.27041869887971598,0.27476203623272699,0.27924384919828399,0.28389589727138098,0.28872775314302102,0.29371209816502503,0.298867275335015,0.304198210031906,0.30973700077755401,0.31551082902129801,0.32152732477611301,0.327793256179294,0.33421183592240999,0.34088870700300899,0.347885334732905,0.35522516974722401,0.36283666992203001,0.37076856589045298,0.37906009485214298,0.38778753390617998,0.39694827284566903,0.40660984263057198,0.41674252390150002,0.42728950794957898,0.43844437203223802,0.45032580974535602,0.46300565832776103,0.47651111994995299,0.49059211549276399,0.50549793100451601,0.52119796276254404,0.53739184520690297,0.55437238615693796,0.57269104112885905,0.59228520271273999,0.61342019926470803,0.63618080409066802,0.66086067976122098,0.68748320964593101,0.71668444938443199,0.74834453812426405,0.78289675679830395,0.81814885034305196,0.85581759182518302,0.89611565145785199,0.93419029317254498,0.96764646071906502,0.98786139406898299,0.99860902001592,0.99999999999998301,0.99999999999998002,0.999999999999999,0.99999999999998501,1.00000000000005,1.0000000000000899,0.99999999999996003,1]
[4.1875,0.19623622401995799,0.19850463811078101,0.20082928635594299,0.203208554576159,0.20564305016135401,0.20814282878370399,0.210702364936079,0.21331916079535301,0.216007430612985,0.21877182389911801,0.22161558190071501,0.224537976712957,0.227523112777372,0.23058878580365,0.23374008132629501,0.23698897160764501,0.24033839414626401,0.24377954240479199,0.247293030576485,0.25089847878738403,0.25461343421757199,0.25843675124295001,0.26238963443372498,0.266476062575983,0.27069948269098698,0.27504792520418903,0.27953503240994299,0.28419257450588498,0.289010943603832,0.29398187084636701,0.29914244346996599,0.304486705939845,0.31005523955995301,0.315847042281234,0.32187791274599098,0.32811928389168099,0.33453338462924698,0.34122656154356801,0.34823631449665998,0.355570039727515,0.36321014608644903,0.371146544097463,0.37944801985403198,0.38818594336753498,0.397357749236457,0.40703101834675698,0.41712721755555399,0.42767664926434901,0.43884361151303403,0.45073792791901501,0.46343151377380198,0.476917772365196,0.49101329120846798,0.50589830791935997,0.52152507471648701,0.53770632307441302,0.55469996726883997,0.57308466598115104,0.59273190422870004,0.61389263562777996,0.636721312924586,0.66142471863063601,0.68808377501641804,0.71724998071679802,0.74883590979047898,0.78327748610442904,0.81845467799582505,0.85619557002909197,0.89668891839985898,0.93481567529034104,0.96813783238233198,0.98818897517724602,0.99873186293124605,0.99999999999998301,0.99999999999998002,0.999999999999999,0.99999999999998501,1.00000000000005,1.0000000000000899,0.99999999999996003,1]
[4.25,0.19643277268801701,0.19870367473665801,0.20103087473342901,0.20341846412487699,0.205862874329554,0.20835681913823301,0.21091484998259399,0.21353455659592399,0.21622581802189,0.218993287187015,0.22184020894986101,0.224766090808421,0.227752676244907,0.23081926650792101,0.23397832213596201,0.237230877660529,0.24058569077090899,0.244044727115522,0.24756249245995801,0.25117235807877097,0.25487840912199999,0.25870325791131499,0.26266073604463502,0.266751920355492,0.27098026650225898,0.27533381417565,0.27982621562160098,0.28448577917690798,0.28927552834900999,0.29425164352770899,0.29941761160491798,0.30476748975100199,0.31034187303382299,0.31615450802419598,0.32219159701179201,0.32840661463512699,0.33483930422660502,0.34154652449101902,0.34856786284635299,0.35589497901686301,0.36353014205140599,0.37151445556124502,0.37983594485592198,0.38858435282888998,0.39776722562724498,0.40745219406294297,0.41749691803975802,0.42803989172349599,0.43924285099382998,0.45115004609267401,0.46382874717566003,0.47732442478043802,0.49140426943256899,0.50628359940721701,0.52182745728147495,0.53802080094192295,0.55502754838074198,0.57344045632579099,0.593171265099527,0.61432496776147205,0.63726182175850399,0.66194195196431105,0.688680000912826,0.71777025659897897,0.74932728145669403,0.78360506721501999,0.81873546180468904,0.85657354823300003,0.89726218534186597,0.93544105740813599,0.96862920404559905,0.98851655628550905,0.99885470584657099,0.99999999999998301,0.99999999999998002,0.999999999999999,0.99999999999998501,1.00000000000005,1.0000000000000899,0.99999999999996003,1]
[4.3125,0.196629321356075,0.19890271136253501,0.201232463110915,0.20362267053323399,0.206066806240738,0.208566471050802,0.21112733502910999,0.213749952396495,0.21644420543079601,0.21921475047491301,0.222064835999007,0.224989066938865,0.22796945786401199,0.23103928367357299,0.23420259686289399,0.237463875405897,0.24082768445354,0.24429722641066001,0.24783195434343,0.25143735762367497,0.25514047401257101,0.25896976457967902,0.26293183765554501,0.267027778135001,0.27126105031353098,0.27561970314711198,0.28011739883325998,0.284747484742368,0.28954011309418898,0.29452141620905198,0.29969277973987002,0.30504827356216002,0.31062850650769303,0.31643534916948002,0.32245573208227601,0.32867339015147501,0.33512261234442697,0.341849095572964,0.34887156010147802,0.35618934441814198,0.36382496505290401,0.371839624834925,0.38020082476341799,0.38898276229024498,0.39817670201803301,0.40785456303290801,0.417843768629511,0.42839725293713099,0.43961700891126299,0.451562164266333,0.464221844510467,0.47773107719568098,0.49179034717196402,0.50664757842071095,0.522129839846463,0.53833527880943299,0.55535512949264498,0.57378228009463395,0.59357329646389101,0.61474614347637402,0.63780233059242197,0.66245918529798598,0.68922596943144998,0.71828726987771996,0.74981470793906202,0.78393264832561205,0.81901624561355402,0.85695152643690897,0.89783545228387296,0.93606643952593105,0.969120575708867,0.98884413739377097,0.99897754876189704,0.99999999999998301,0.99999999999998002,0.999999999999999,0.99999999999998501,1.00000000000005,1.0000000000000899,0.99999999999996003,1]
[4.375,0.19682587002413399,0.19910174798841199,0.20143405148839999,0.20381695106811601,0.20626076874209201,0.20877015460321299,0.21133982007562499,0.213965348197066,0.21666259283970099,0.21943621376281,0.22228653588956901,0.22520270679538301,0.228186239483118,0.231259300839225,0.23442594762195701,0.237690662330476,0.24105801492380599,0.24453290309058301,0.248085396914593,0.25169512636850899,0.25540253890314102,0.25923627124804399,0.26320293926645399,0.26730363591451001,0.27154183412480198,0.27590559211857402,0.280387990524884,0.28500707732255798,0.28980469783936802,0.29479118889039402,0.29996794787482201,0.305329057373317,0.310915139981563,0.31670717179513702,0.32271209990979899,0.32893545504181199,0.33539063325497798,0.34212687092922001,0.34914356082789,0.35646077347765598,0.36411654091473,0.37214200740053299,0.38053702643172299,0.389335694391788,0.39857165771991798,0.40821635652467197,0.41819061921926398,0.42875461415076499,0.43998553766276699,0.45194236525210801,0.46461494184527402,0.478135646512932,0.49217642491135999,0.507004949266883,0.52243222241145104,0.53864975667694304,0.55568271060454699,0.57412410386347601,0.59397532782825502,0.61516731919127499,0.63831337388231302,0.66297641863166101,0.68977193795007397,0.71874973732854797,0.75024454847258004,0.78426022943620399,0.819297029422419,0.85732950464081803,0.89835926895930795,0.936691821643727,0.96961194737213496,0.989171718502034,0.99910039167722198,0.99999999999998301,0.99999999999998002,0.999999999999999,0.99999999999998501,1.00000000000005,1.0000000000000899,0.99999999999996003,1]
[4.4375,0.197022418692193,0.19930078461428899,0.20162515578524701,0.20400839457594999,0.20645473124344499,0.208966703271246,0.211546929323707,0.21418074399763701,0.216880980248607,0.21965667447354201,0.22249712374814301,0.2254163466519,0.22840302110222399,0.231479318004877,0.234649298381019,0.23791744925505401,0.24128834539407201,0.244766889600051,0.24832315740000999,0.251942458717967,0.25566460379371098,0.25950277791640802,0.26347404087736398,0.26757949369401901,0.27182261793607398,0.27618582451121698,0.28064277583508501,0.28526666990274802,0.29006928258454701,0.295060961571737,0.30024311600977399,0.30560984118447398,0.31118274733893703,0.316960030808767,0.32296846773732302,0.32919751993214902,0.33565865416552798,0.34237899900631003,0.349381585962457,0.35670276956462399,0.364376214424942,0.37242965077555701,0.380849097426818,0.38968098259162898,0.398926537258601,0.40851953563952997,0.418516514055224,0.42910200484212901,0.44035406641427199,0.45229108062981899,0.46498083027658799,0.47850841122690402,0.49254830475466999,0.50733253037902803,0.52271524426925597,0.53894005687394597,0.556010291716449,0.57446592763231896,0.59433739216066805,0.61558849490617695,0.63879942385958099,0.66349365196533705,0.69028750457296195,0.71916995221677604,0.75061307722224202,0.78458781054679605,0.81957781323128298,0.85770748284472698,0.89885064062388598,0.93731720376152206,0.97010331903540303,0.98949929961029703,0.99922323459254803,0.99999999999998301,0.99999999999998002,0.999999999999999,0.99999999999998501,1.00000000000005,1.0000000000000899,0.99999999999996003,1]
[4.5,0.19721896736025099,0.19948913286077599,0.20181414488914001,0.204199838083785,0.206648693744798,0.20916325193927801,0.21174613405481499,0.214391375192479,0.217099367657512,0.21986429630594601,0.22270771160671701,0.22562998650841701,0.22861980272133001,0.23169933517052901,0.23487264914008199,0.23814423617963301,0.24151867586433801,0.24500087610951801,0.248560917885426,0.25218411691624998,0.255917428476997,0.259769284584772,0.26374514248827402,0.26785535147352801,0.27210340174734599,0.276438240613266,0.28089756114528602,0.285526262482939,0.29033386732972499,0.29533073425307899,0.30051828414472598,0.30588482022956098,0.31144529825922501,0.31721094400168098,0.32322483556484599,0.329459584822486,0.33592367732140799,0.34263039846502202,0.349615572471627,0.356942463061801,0.36462190025952401,0.37268272420161802,0.381138636980352,0.39001445486053599,0.39928141679728402,0.40880031945032003,0.41882167354425298,0.42942958595462699,0.440693609583165,0.45262230465902098,0.46533595396032901,0.47885294527313599,0.492899284517757,0.50766011149117296,0.52297982901361995,0.539215225008018,0.55633787282835101,0.57478215101276697,0.59469475337343602,0.61600967062107903,0.63924165836005997,0.66401088529901198,0.690778876239724,0.71957461123624999,0.750981605971903,0.784915391657387,0.81985859704014796,0.85808546104863603,0.899342012288464,0.937942585879318,0.97059469069866999,0.98982688071855995,0.99934607750787396,0.99999999999998301,0.99999999999998002,0.999999999999999,0.99999999999998501,1.00000000000005,1.0000000000000899,0.99999999999996003,1]
[4.5625,0.19740469072610101,0.199675729697536,0.20200313399303299,0.20439128159161901,0.206842656246151,0.20935980060731099,0.211945338785923,0.214593308755514,0.21730083992154201,0.220071918138349,0.22291829946529099,0.22584362636493499,0.22883658434043599,0.23191935233618,0.23509599989914501,0.23837102310421099,0.241749006334604,0.245234862618985,0.24879867837084299,0.25242577511453201,0.25616311431190603,0.26002780540599302,0.26401624409918401,0.26813120925303702,0.27236872097843701,0.27668839346329499,0.28115234645548698,0.28578585506312898,0.29059845207490398,0.29560050693442103,0.30079345227967802,0.30614554805420702,0.311690984093971,0.31746185719459502,0.32348120339237002,0.32972164971282403,0.33616936315607898,0.34286071886713698,0.349849558980797,0.357182156558977,0.36486758609410502,0.372934709672959,0.38139725364827798,0.390306621798863,0.39957388025407697,0.409079560194549,0.41911071570238001,0.42973811373647802,0.44101640029967099,0.45293931863875903,0.465663535072668,0.47919182228583801,0.49322042955178902,0.50795695308275601,0.52324441375798403,0.53949039314208902,0.55666545394025402,0.57508124681050299,0.59500871355661999,0.616430846335981,0.63968389286053795,0.66451331984548601,0.69127024790648595,0.71997927025572495,0.75135013472156498,0.78518414460839903,0.82013938084901306,0.85846343925254498,0.89983338395304202,0.93856796799711395,0.97108606236193795,0.99015446182682298,0.99946892042319901,0.99999999999998301,0.99999999999998002,0.999999999999999,0.99999999999998501,1.00000000000005,1.0000000000000899,0.99999999999996003,1]
[4.625,0.19758895510240601,0.199862326534296,0.202192123096925,0.20458272509945399,0.20703661874750501,0.209556349275343,0.21214454351703099,0.21478446848191199,0.217491928904334,0.22027605877817499,0.22312888732386499,0.226057266221452,0.22905336595954101,0.232139369501832,0.235319350658208,0.23859781002878899,0.24197933680486999,0.24546884912845299,0.24903643885626001,0.25266743331281399,0.256408800146816,0.26027765540758502,0.26428066484109702,0.26839937970262101,0.27263054580740198,0.27693854631332399,0.28140713176568799,0.28604544764331902,0.29086303682008202,0.29587027961576401,0.30105585327818901,0.30639733358663801,0.31193666992871699,0.317712770387509,0.32373757121989299,0.329977153971382,0.33641504899074998,0.34308926382960298,0.35008354548996701,0.35742185005615401,0.36511327192868798,0.37318669514429897,0.38165587031620501,0.39058659225584502,0.399793875149902,0.40933226562426001,0.41938305508818802,0.43003293467634901,0.44129783606405798,0.45325565959379999,0.46599111618500699,0.47953069929853998,0.493501213362258,0.50821796792681295,0.523508998502349,0.53976556127616004,0.55699303505215603,0.57538034260824,0.59532140461779204,0.61685202205088296,0.64012612736101704,0.66497882984579304,0.691761619573247,0.72038346429502398,0.75171866347122596,0.78544620949687205,0.82042016465787804,0.85884141745645404,0.90032475561762004,0.93919335011490901,0.97157743402520602,0.99048204293508502,0.99959176333852495,0.99999999999998301,0.99999999999998002,0.999999999999999,0.99999999999998501,1.00000000000005,1.0000000000000899,0.99999999999996003,1]
[4.6875,0.19777321947871099,0.20004892337105501,0.202381112200818,0.204774168607288,0.20723058124885799,0.20975289794337501,0.21233492700553899,0.214972939807411,0.21768301788712699,0.220469839155085,0.22333667148198399,0.22627090607796899,0.229270147578647,0.23235938666748401,0.23554270141726999,0.238824596953368,0.24220966727513599,0.24570283563792,0.24927419934167699,0.25290909151109597,0.25665448598172502,0.26052750540917602,0.26453464434061402,0.26865267914200402,0.27287623164226399,0.27718869916335298,0.281661917075889,0.28630504022351,0.29112762156526101,0.29613986848880602,0.30131136654635898,0.30663800542477299,0.31218235576346198,0.31796368358042298,0.32399393904741702,0.330217380120858,0.33663883099201902,0.34331780879206802,0.35031753199913701,0.35766154355333002,0.36535895776326899,0.37343868061563901,0.381914486984131,0.39083940227729103,0.40001226255832201,0.40957251377571302,0.41964319303050301,0.430300955586575,0.44155515483082403,0.45353649430055698,0.466312065033469,0.47983872911664099,0.49378199717272803,0.50847275323625896,0.52374250447366799,0.54004072941023096,0.55731979847125601,0.57567943840597802,0.59563409567896397,0.61722751386399699,0.64056836186149502,0.66542120005382399,0.69225299124000905,0.72073031488314498,0.75208719222088805,0.78566582026215803,0.82070094846674202,0.85921939566036298,0.90081612728219795,0.93980991423942195,0.97206880568847298,0.99080962404334805,0.99971460625385,0.99999999999998301,0.99999999999998002,0.999999999999999,0.99999999999998501,1.00000000000005,1.0000000000000899,0.99999999999996003,1]
[4.75,0.19794876467609601,0.20023111251579701,0.20257010130471101,0.20496561211512199,0.20742454375021199,0.20994252589367099,0.21252085142124,0.21516141113291101,0.21787410686991901,0.22066361953199501,0.223533220149986,0.226482445413314,0.22948692919775299,0.23257940383313599,0.23576605217633301,0.239051383877946,0.24243999774540301,0.24593682214738699,0.24951195982709301,0.25315074970937801,0.25690017181663499,0.26077735541076802,0.26477185825015997,0.26889405469907401,0.27311802650240902,0.27743885201338198,0.28191670238609001,0.28656463280369998,0.29139220631043999,0.29639037169290999,0.30155281688723001,0.30687867726290802,0.31242804159820797,0.31821459677333702,0.324240327195985,0.330456764528686,0.33686218175081101,0.34354635375453402,0.35055151850830701,0.35790123705050603,0.365604643597852,0.37369066608697898,0.38217310365205798,0.39107844795410401,0.40021442381383698,0.40979714082434499,0.41990333097281801,0.43054521539902002,0.44180084066516001,0.45379010548434701,0.46658530189799302,0.48012484766405,0.494062780983197,0.50871575174760597,0.523969291397409,0.54031253551557201,0.55760643194417103,0.57597853420371503,0.59594678674013601,0.61760189227724305,0.64099243349396495,0.66583498672076502,0.69274436290677099,0.72107716547126699,0.75245572097055002,0.78586236892851402,0.820981732275607,0.85959737386427204,0.90130749894677498,0.94029577955542898,0.97256017735174105,0.99113720515160997,0.99983744916917605,0.99999999999998301,0.99999999999998002,0.999999999999999,0.99999999999998501,1.00000000000005,1.0000000000000899,0.99999999999996003,1]
[4.8125,0.19812074476064701,0.20040526956343899,0.20274651213361,0.20514886359979201,0.20761343382864,0.21012597131716801,0.212706775836941,0.21534988245841,0.218065195852711,0.22085739990890599,0.22372976881798901,0.226681842612731,0.229702337499503,0.232799420998788,0.235989402935396,0.239278170802525,0.242670328215669,0.24617080865685501,0.24974972031251,0.25339240790766099,0.25714585765154402,0.26101762500936998,0.26500907215970598,0.269135430256144,0.27334616334906803,0.27768660563481501,0.28217148769629102,0.28682422538389102,0.29164982485072999,0.29664087489701402,0.30178867528861703,0.30711934910104199,0.31267372743295402,0.318465509966252,0.32447533103788101,0.33067515193730102,0.33708553250960299,0.34377489871700001,0.35078550501747702,0.35814093054768298,0.36585032943243401,0.37394265155832002,0.38242553382803801,0.39128049608090398,0.40040551279620401,0.410021767872978,0.42013614864960203,0.43078345620810898,0.44204652649949699,0.45404371666813698,0.46684736678786398,0.48035836656633502,0.49432392127713998,0.50893413915570296,0.52419607832115001,0.54054839391620502,0.55789306541708505,0.57627763000145205,0.59625947780130795,0.61796410229585497,0.64138553082772298,0.66624877338770505,0.69318366336881199,0.721424016059388,0.75277039778856303,0.78605891759486901,0.82126251608447198,0.85994967988107296,0.901798870611353,0.94074248106814096,0.97305154901500901,0.99142846621790404,0.99996029208450099,0.99999999999998301,0.99999999999998002,0.999999999999999,0.99999999999998501,1.00000000000005,1.0000000000000899,0.99999999999996003,1]
[4.875,0.198292724845198,0.200579426611082,0.20292290196391,0.205327544207104,0.20779446549656899,0.210309416740665,0.21289270025264301,0.21553835378391001,0.21825628483550399,0.221051180285816,0.22392631748599101,0.226881239812147,0.229904667010669,0.23301881927526299,0.23621275369445899,0.23950495772710301,0.24290065868593499,0.24640479516632199,0.24998748079792699,0.25363406610594302,0.25738925340158902,0.26125081834418901,0.26524628606925199,0.26937680581321499,0.27357430019572598,0.27791889042412798,0.28242542875759402,0.287083817964081,0.29189551068553798,0.29687239410473099,0.30202453369000398,0.30736002093917703,0.31291941326770001,0.31870414728004098,0.32470827550114201,0.33089353934591498,0.33730888326839498,0.344003443679466,0.35101949152664802,0.35838062404485999,0.36609601526701602,0.37419463702965999,0.38265828882917202,0.391466420496203,0.40059660177857198,0.41022596632482899,0.42036429228505001,0.43100845609488603,0.44229221233383298,0.454297327851927,0.467109431677736,0.480561692773956,0.49456960711129999,0.50915252656379995,0.52442286524489101,0.54078425231683702,0.55817969888999996,0.57657672579918995,0.59657216886247999,0.618291683407446,0.64177625910065295,0.66666256005464497,0.69360548757464902,0.721770866647509,0.75307750507994797,0.786255466261224,0.82154329989333696,0.86025206244420005,0.90226761468180094,0.94118918258085205,0.97354292067827597,0.99154099959809305,0.999999999999997,0.99999999999998301,0.99999999999998002,0.999999999999999,0.99999999999998501,1.00000000000005,1.0000000000000899,0.99999999999996003,1]
[4.9375,0.19846470492974999,0.200753583658725,0.20309929179420999,0.20550622481441699,0.20797549716449901,0.21049286216416199,0.21307862466834401,0.21572682510940999,0.21844737381829599,0.221244960662726,0.22412286615399399,0.227080637011563,0.230106996521834,0.233224168629872,0.23643610445352201,0.23973174465168201,0.24313098915620099,0.24663878167579001,0.250225241283344,0.253875724304226,0.25761856018083801,0.26148401167900798,0.265483499978798,0.26960712317033902,0.27380243704238499,0.27815117521344102,0.28266201511706701,0.28732991788228601,0.29213637881861698,0.297103627831596,0.30226039209139199,0.307600692777312,0.313165099102446,0.318934151040212,0.324921915357411,0.33111192675452999,0.33753223402718702,0.344231988641931,0.35125347803581802,0.35862031754203599,0.36634170110159803,0.37444662250100103,0.38289104383030698,0.39165234491150303,0.40078769076094001,0.41042251499238303,0.420566621795739,0.43121691680284002,0.44253789816816902,0.45455093903571703,0.46737149656760701,0.48076501898157797,0.494801445076402,0.50937091397189704,0.52464965216863302,0.54102011071747003,0.55846633236291499,0.57687582159692696,0.59688485992365203,0.61861926451903604,0.64212021926769203,0.667076346721586,0.69391009500399803,0.72211771723563001,0.75338461237133303,0.78645201492757899,0.82182408370220195,0.86055444500732703,0.902677091068949,0.94163588409356302,0.97403429234154504,0.99165019330084703,0.999999999999997,0.99999999999998301,0.99999999999998002,0.999999999999999,0.99999999999998501,1.00000000000005,1.0000000000000899,0.99999999999996003,1]
[5,0.19863668501430101,0.20092774070636699,0.20327568162451001,0.20568490542172899,0.20815652883242899,0.21067630758765901,0.21326454908404499,0.21591529643491,0.21863846280108801,0.22143874103963601,0.22431941482199699,0.22728003421098,0.230309326033,0.23342951798448,0.236644729771224,0.23995853157625999,0.24336131962646701,0.246872768185257,0.25046300176876102,0.254106033162392,0.25784786696008699,0.261717205013827,0.26572071388834401,0.26983125761618998,0.27403057388904301,0.27838346000275399,0.28289702645411002,0.287553224408228,0.29236316574305599,0.29733486155846101,0.30249625049278001,0.30784136461544698,0.313396795920728,0.31916099113519603,0.32513555521368098,0.33133031416314401,0.33775558478598,0.34446053360439699,0.35148746454498803,0.358860011039213,0.36658738693617998,0.37467349376363501,0.38312379883144099,0.39183826932680199,0.40097877974330798,0.410619063659936,0.42074409550056602,0.43142537751079302,0.44275465448783202,0.454804550219508,0.46763356145747798,0.48096834518919901,0.495012032934254,0.50958930137999303,0.52487643909237403,0.54125596911810303,0.55872120459809604,0.57717491739466498,0.59719755098482397,0.61894684563062696,0.642464179434731,0.66749013338852703,0.69413115478147602,0.72243205560102897,0.75364498583929995,0.78664856359393398,0.82210486751106704,0.86085682757045501,0.90308656745609805,0.942082585606274,0.974525664004812,0.991759387003601,0.999999999999997,0.99999999999998301,0.99999999999998002,0.999999999999999,0.99999999999998501,1.00000000000005,1.0000000000000899,0.99999999999996003,1]