{"text_format":"1","workbook":"xlsx","n_sheets":7,"sheets":["Eingabe","Berechnung WR","Moduldatenbank","Wechselrichterdaten","Berechnung Speicher","Autarkiegrad","Eigenverbrauch"],"not_rendered":{"charts":0,"images":2,"macros":1,"external_links":0,"defined_names":2,"comments":0,"pivot_tables":0},"unopened":[],"bounds":{"document_bytes":16777216,"sheet_cells":100000,"rows_first":2000,"rows_last":500,"rows_between":2000,"halvings":0,"cell_chars":16384,"cell_head_chars":4096},"cells_cut":0,"cells_raw":0,"read":"whole","date_system":"1900"}

{"sheet":"Eingabe","index":0,"n_rows":49,"n_cols":23,"rows_kept":49,"cut":false,"hidden":false,"merged":[[48,1,48,16],[15,6,15,8],[4,6,4,9],[23,10,23,11],[46,9,46,16],[46,1,46,6],[12,6,12,9],[25,11,25,12],[25,14,25,15]]}
[]
[null,null,"WECHSELRICHTER UND SPEICHER AUSLEGUNG"]
[null,null,"Grunddaten",null,null,null,null,null,null,null,null,"Einstellungen"]
[]
[null,null,"Modulauswahl",null,null,null,null,null,null,null,null,null,null,"Cos ϕ",null,{"$f":"W5/100","v":1},null,null,null,null,null,null,100]
[]
{"$rows_left_out":44}
{"sheet":"Berechnung WR","index":1,"n_rows":38,"n_cols":11,"rows_kept":38,"cut":false,"hidden":true,"merged":[[7,3,11,3]]}
[]
[]
[null,"Ausgewähltes Modul"]
[null,4,null,"Leistung","MPP Spannung","MPP Strom","Leerlaufspannung","Kurzschlussstrom","Pmpp","VOC","Isc"]
[null,1,{"$f":"VLOOKUP(B5,Moduldatenbank!A2:J92,2)","v":"Jinko JKM420N-54HL4"},{"$f":"VLOOKUP(B5,Moduldatenbank!A2:J97,3)","v":420},{"$f":"VLOOKUP(B5,Moduldatenbank!A2:J97,4)","v":31.51},{"$f":"VLOOKUP(B5,Moduldatenbank!A2:J97,5)","v":13.33},{"$f":"VLOOKUP(B5,Moduldatenbank!A2:J97,6)","v":38.11},{"$f":"VLOOKUP(B5,Moduldatenbank!A2:J97,7)","v":14.07},{"$f":"VLOOKUP(B5,Moduldatenbank!A2:J97,8)","v":-0.3},{"$f":"VLOOKUP(B5,Moduldatenbank!A2:J97,9)","v":-0.25},{"$f":"VLOOKUP(B5,Moduldatenbank!A2:J97,10)","v":4.5999999999999999E-2}]
[]
{"$rows_left_out":33}
{"sheet":"Moduldatenbank","index":2,"n_rows":58,"n_cols":10,"rows_kept":58,"cut":false,"hidden":false,"merged":[]}
[null,null,"Leistung","MPP Spannung","MPP Strom","Leerlaufspannung","Kurzschlussstrom","Pmpp","VOC","Isc"]
[1,"Jinko JKM420N-54HL4",420,31.51,13.33,38.11,14.07,-0.3,-0.25,4.5999999999999999E-2]
[2,"EGing 400W, EG-M54-HLV",400,31.28,12.79,37.18,13.54,-0.35,-0.27500000000000002,0.05]
[3,"EGing 395W, EG-M54-HLV, black",395,30.82,12.82,36.770000000000003,13.55,-0.35,-0.27500000000000002,0.05]
[4,"Q CELLS Mono Q.PEAK DUO G8 360 Wp",360,34.85,10.33,41.19,10.84,-0.35,-0.27,0.04]
[5,"Q Cells Q.PEAK DUO ML-G9 390 Wp",390,38.01,10.26,45.06,10.71,-0.35,-0.27,0.04]
{"$rows_left_out":53}
{"sheet":"Wechselrichterdaten","index":3,"n_rows":31,"n_cols":10,"rows_kept":31,"cut":false,"hidden":true,"merged":[]}
[null,"Wecheselrichterdaten","Max. Eingansspannung","Max. DC_Leistung","Eingangsspannung MIN","Eingangsspannung MPPT MIN bei AC-Nennausgangsleistung","Eingangsspannung MPPT MAX bei AC-Nennausgangsleistung","Max. Eingangsstrom pro Mppt (A)","Max. Eingangsstrom pro Mppt (B)","Nennausgangsleistung"]
["Ergebnis",{"$f":"VLOOKUP(B31,A3:J21,2)","v":"H3-8.0-E"},{"$f":"VLOOKUP(B31,A3:J21,3)","v":1000},{"$f":"VLOOKUP(B31,A3:J21,4)","v":10400},{"$f":"VLOOKUP(B31,A3:J21,5)","v":160},{"$f":"VLOOKUP(B31,A3:J21,6)","v":240},{"$f":"VLOOKUP(B31,A3:J21,7)","v":800},{"$f":"VLOOKUP(B31,A3:J21,8)","v":26},{"$f":"VLOOKUP(B31,A3:J21,9)","v":14},{"$f":"VLOOKUP(B31,A3:J21,10)","v":8000}]
[1,"H1-3.0-E",600,3900,75,80,550,13.5,13.5,3000]
[2,"H1-3.7-E",600,4680,75,80,550,13.5,13.5,3680]
[3,"H1-4.6-E",600,5980,75,80,550,13.5,13.5,4600]
[4,"H3-5.0-E",1000,7500,160,240,800,14,14,5000]
{"$rows_left_out":26}
{"sheet":"Berechnung Speicher","index":4,"n_rows":43,"n_cols":7,"rows_kept":43,"cut":false,"hidden":true,"merged":[[21,0,21,2],[6,4,7,4],[13,4,14,4],[6,5,7,5],[6,6,7,6],[13,5,14,5],[13,6,14,6]]}
[]
["Nutzbare Speicherkapazität",{"$f":"VLOOKUP(B43,A23:C27,3)","v":7.7760000000000007},"kWh",null,"Spalten","PV-Leistung ","in kWp/MWh Jahresstrombedarf"]
["Stromverbrauch",{"$f":"Eingabe!G16","v":5397},"Wh",{"$f":"B3/1000","v":5.3970000000000002},"Zeilen","nutzbare Speicherkapazität","in kWh/MWh Jahresstrombedarf"]
["KWp",{"$f":"Eingabe!K31","v":10080},"Wp",{"$f":"B4/1000","v":10.08}]
[]
[]
{"$rows_left_out":38}
{"sheet":"Autarkiegrad","index":5,"n_rows":82,"n_cols":82,"rows_kept":82,"cut":false,"hidden":true,"merged":[]}
[null,5,4.9375,4.875,4.8125,4.75,4.6875,4.625,4.5625,4.5,4.4375,4.375,4.3125,4.25,4.1875,4.125,4.0625,4,3.9375,3.875,3.8125,3.75,3.6875,3.625,3.5625,3.5,3.4375,3.375,3.3125,3.25,3.1875,3.125,3.0625,3,2.9375,2.875,2.8125,2.75,2.6875,2.625,2.5625,2.5,2.4375,2.375,2.3125,2.25,2.1875,2.125,2.0625,2,1.9375,1.875,1.8125,1.75,1.6875,1.625,1.5625,1.5,1.4375,1.375,1.3125,1.25,1.1875,1.125,1.0625,1,0.9375,0.875,0.8125,0.75,0.6875,0.625,0.5625,0.5,0.4375,0.375,0.3125,0.25,0.1875,0.125,6.25E-2,0]
[0,0.41067385123141198,0.41010580618349501,0.40952622097144598,0.40893586501010598,0.408332865668737,0.40771690721786402,0.407088566725403,0.40644879704911901,0.40579636994297402,0.40513130534743602,0.40445117182750401,0.40375518742467997,0.40304186557948002,0.40231324390247603,0.40156844204042402,0.40080549551038902,0.40002477104644701,0.39922513555702899,0.39840576850317,0.39756709357944497,0.39670958372989701,0.39583194657065501,0.39493436687045003,0.39401504400669002,0.393073884099646,0.39210947862707801,0.39111840881681398,0.39009953875929199,0.389050894339525,0.387972270125583,0.386861738246705,0.38571843575566001,0.384537911171145,0.38331781073822502,0.38205667815348199,0.38075662915457098,0.37941518066832203,0.37802560146596398,0.37658639915063102,0.37509589945684202,0.373550876247009,0.37194884802223499,0.37028438707070699,0.36855725777750398,0.36676073491692301,0.36489481319057399,0.36295148241055902,0.36093380503582201,0.35882275930947799,0.35661365709029902,0.35430324301426602,0.35188330723779698,0.34934437186919598,0.34666903729504001,0.34384879991739897,0.34087677395585497,0.33774672319519999,0.33444510516992898,0.33095486009870101,0.32725220917575099,0.32331625481465898,0.31911510649831099,0.314620019187699,0.30977306746926297,0.304528040093408,0.29886511448776498,0.292725120840229,0.28600557992855602,0.278612560979976,0.270376634096683,0.26102113177152297,0.25012381492870001,0.237515078326167,0.22308912025490699,0.20663971904260001,0.187805494507811,0.16596160752779299,0.13990858307486601,0.10702745038528801,6.1634027679739301E-2,0]
[6.25E-2,0.43569097220720598,0.43518694092446802,0.43467016617330501,0.43414145404488602,0.43360200087963102,0.43304862947478001,0.432481204750927,0.43189611417707102,0.43129805064668297,0.43068480484445498,0.43005935554796498,0.429419890446954,0.42876422977268702,0.42809386106616598,0.427405630184091,0.42669914942818199,0.425971786480556,0.42522773135261999,0.424465979646307,0.42368195862184499,0.42287156642039903,0.42203661268683901,0.42117953244591899,0.42030249038202899,0.41940524365752002,0.41848080696453999,0.41752975660295499,0.41655374242480298,0.415544298463976,0.41450477540333602,0.41344045269875601,0.41234084840697799,0.41120769392197098,0.41003832678982799,0.40883372047654298,0.407592929625471,0.406303794774799,0.40497216366578898,0.403587751990926,0.40214846841888302,0.40065555239748901,0.39910989649166501,0.39750366645039098,0.39584283497393602,0.39412659470158201,0.39234758966927302,0.39050031184429501,0.38858647378015898,0.38658603584579498,0.38449563339715997,0.38231504210492201,0.38002513795750997,0.37760771586422998,0.37505851993161099,0.37237524058167798,0.36955328175148699,0.36658688160076403,0.363440592773981,0.36011540604001901,0.35656363135326002,0.35273774899722299,0.34865229312150597,0.34427116780425099,0.339551346830476,0.33445947234652201,0.32892728634455298,0.32294247706988699,0.316391174659791,0.309082300901242,0.30095040025678299,0.291921363767912,0.28165322055437098,0.26956268325986499,0.255052635123795,0.237897231195702,0.217339001588924,0.19259997246803601,0.16139499520824399,0.119498955449039,6.3700668562018406E-2,0]
[0.125,0.45742989023256297,0.45693864362485898,0.45643659655614199,0.45592359037122199,0.45539720077673301,0.45485801680673499,0.454307286542523,0.45374640268347599,0.45317440903455802,0.45258937429718998,0.45198350433270101,0.45135298031926802,0.45070243647716401,0.45003376544859103,0.44934998446503399,0.44864723564512199,0.44793012799946702,0.44719434132345398,0.44643497253223302,0.445654854755832,0.44485506262569202,0.44403497048753199,0.44319332959978203,0.44233162376899698,0.44143104689228002,0.44050210690175701,0.43954360070605097,0.43856086771987501,0.43754281868393802,0.436489200658223,0.43540956920551999,0.43429687420399699,0.43315731546283798,0.43197476076052099,0.43075824098683002,0.429510611169934,0.42822328367927198,0.42689823717974201,0.42551810942646501,0.42408734754751698,0.42261554246698302,0.42109676769910798,0.41952841909129002,0.41790010552860901,0.41621281281713302,0.414478601626316,0.41266629543800898,0.41078176882617001,0.408817859642504,0.40675758574645099,0.40459322184109903,0.40231821036359799,0.39994320944672301,0.39745351176924598,0.39480598931414501,0.39201043835970001,0.38906743895552898,0.38595007137826698,0.38259540859380498,0.37901140589186999,0.37519594125668099,0.37112204603901899,0.36679545882452802,0.36213217035294099,0.35697298814281597,0.35139327913623603,0.34534591817438998,0.33864024105024298,0.33120162196205,0.322963763500488,0.31382572381108398,0.30342541180559501,0.29123707256521503,0.27672041115164198,0.25842894235477298,0.23550738092426499,0.20748985486122001,0.170445659111812,0.122534762050978,6.3700668562018406E-2,0]
[0.1875,0.477721416528813,0.47722941337567498,0.47672928781604401,0.476216244824677,0.47569188839576698,0.47514396542501702,0.47458362554489902,0.47400732649865501,0.47341744365729499,0.47281344552819998,0.47218858233872602,0.47154527860371198,0.47087467367414398,0.47018219582842102,0.469473631341083,0.46875451648650202,0.46802216855567602,0.46726946012246501,0.46649133155655498,0.46568228477380003,0.46485555517063398,0.46400631569120898,0.46313768367278502,0.462247187933291,0.461338468229962,0.46040528253333701,0.459437935744129,0.45844559556582498,0.45742450641930699,0.45636464984218,0.45528331890238599,0.454166936120461,0.453022496057018,0.45183962852111198,0.45061887421861102,0.449347530818341,0.44803240846721398,0.44667755501066703,0.44528066210728501,0.44384289508297498,0.44236519694061899,0.44083951769659901,0.43927568886118501,0.43766245672947601,0.43599738714567898,0.43427220519205301,0.43245973920373698,0.43057682711814299,0.42857679672903498,0.426455124258945,0.42423671959477399,0.42192705958050403,0.41950645151521798,0.41698317412719699,0.41432219859738101,0.41148139505173198,0.40850280417107798,0.40528214317991801,0.40189290900796598,0.39831524361949,0.39453425100537698,0.39049648304156698,0.38608489401163698,0.381290785565018,0.37613173137570299,0.37052350134641299,0.36440075110876602,0.35750010545671601,0.34990557335185402,0.34140734500479297,0.331837316570256,0.3209527035261,0.30813376331970299,0.29293074653361201,0.27340242815314297,0.248593412142911,0.21665771277042001,0.175372598881292,0.124093446005813,6.3700668562018406E-2,0]
[0.25,0.49705462476105899,0.496535050694629,0.49600060150992897,0.49544887669544302,0.49488273378263897,0.49429976077728199,0.49370582185184497,0.49310328036421602,0.49248623989146201,0.49185652280999898,0.491209384230128,0.49054390632056,0.48986344600262999,0.489168531946783,0.48845094287188601,0.48771438328516098,0.48695814463301501,0.486181526791511,0.485382483011154,0.48456160610610799,0.48372253587699798,0.48286000184503203,0.48197683345105802,0.48106850660899397,0.48013578062060103,0.47917124313986798,0.47817768858117199,0.477163750736742,0.47612147178839598,0.47504612864469198,0.47394113775560198,0.47279958741413203,0.471634082578964,0.47043197303693102,0.46918151894535198,0.46789068240834197,0.46655753777441,0.465200025561606,0.46379886083764099,0.462361609236633,0.46088861023086197,0.45936231231072799,0.45779153917520599,0.45615056781255497,0.45441292891002599,0.45259613826130202,0.45068104774726803,0.44866527143863499,0.44655322735367597,0.44436263827317402,0.44210839258053403,0.43975176801030402,0.437292887958113,0.43470476533082703,0.43198046611645602,0.429145607341895,0.42614796000291699,0.42291457531285098,0.41948977430879503,0.41586642273133401,0.411939034736794,0.40775908415770701,0.40326583551976602,0.39842276930690301,0.39314867694705502,0.38748437321381302,0.38122989322565198,0.374182418458049,0.366281429400028,0.35744799456239901,0.34748629449332102,0.33597537822572998,0.322575532493869,0.30605089264400198,0.28508499570965801,0.258410971367242,0.22315951910985701,0.17859455819780001,0.12470870003669,6.3700668562018406E-2,0]
{"$rows_left_out":77}
{"sheet":"Eigenverbrauch","index":6,"n_rows":82,"n_cols":82,"rows_kept":82,"cut":false,"hidden":true,"merged":[]}
[null,5,4.9375,4.875,4.8125,4.75,4.6875,4.625,4.5625,4.5,4.4375,4.375,4.3125,4.25,4.1875,4.125,4.0625,4,3.9375,3.875,3.8125,3.75,3.6875,3.625,3.5625,3.5,3.4375,3.375,3.3125,3.25,3.1875,3.125,3.0625,3,2.9375,2.875,2.8125,2.75,2.6875,2.625,2.5625,2.5,2.4375,2.375,2.3125,2.25,2.1875,2.125,2.0625,2,1.9375,1.875,1.8125,1.75,1.6875,1.625,1.5625,1.5,1.4375,1.375,1.3125,1.25,1.1875,1.125,1.0625,1,0.9375,0.875,0.8125,0.75,0.6875,0.625,0.5625,0.5,0.4375,0.375,0.3125,0.25,0.1875,0.125,6.25E-2,0]
[0,8.0089596647485203E-2,8.0991206608370503E-2,8.1913626504078296E-2,8.2857823009198805E-2,8.3824271304887399E-2,8.4813795784469501E-2,8.5827453633295303E-2,8.6866440279120105E-2,8.7931544941211304E-2,8.9023875579845799E-2,9.0144057104112996E-2,9.1293123613016794E-2,9.2472008375754505E-2,9.3682521014845602E-2,9.4925891056084399E-2,9.6203163471172401E-2,9.7516016834166303E-2,9.8865864872265299E-2,0.10025429117067999,0.101683301386977,0.10315504769541201,0.10467136136741099,0.106234597312867,0.10784673227276199,0.109510359682226,0.11122788867128799,0.113001326025525,0.114833501992594,0.116727213042599,0.118686016042667,0.120713214952166,0.122812722513336,0.12498761113743199,0.12724191105593899,0.129580307338579,0.13200913993952801,0.13453369452021599,0.13715820708069801,0.139889263100826,0.14273402134139301,0.145699751146389,0.14879476531884001,0.15202704207289899,0.15540761145745899,0.158945916627899,0.16265547543290401,0.16654772284866501,0.170640714786917,0.17494399699213301,0.179475560697645,0.18425654109134201,0.18930832311802501,0.19465464015821499,0.200318164187821,0.206330393329242,0.212728875029075,0.21955783690438599,0.22686424227594201,0.23470109890131699,0.24312651946924799,0.25221248678212899,0.262037111223765,0.272698587396763,0.28429143449537297,0.29694522398036499,0.31085152674495498,0.32621279966552003,0.34324181743794102,0.36223339376711,0.38348246489825299,0.40723463378044,0.43359231038004697,0.46320179596962802,0.49722091214973801,0.53731824293682895,0.58601309544646896,0.64731648878280701,0.72759905480352505,0.83489948864837504,0.96158908287570899,1]
[6.25E-2,8.5901750083014594E-2,8.6891991989005102E-2,8.7905029715468597E-2,8.8941916162049106E-2,9.0003958835279105E-2,9.1091389188495603E-2,9.2205179250324801E-2,9.3345453571272496E-2,9.4514578004595506E-2,9.5713192383504203E-2,9.6943455145617294E-2,9.82062879581624E-2,9.9502597194713896E-2,0.10083420368418,0.102201863423543,0.103607219752487,0.105051258147886,0.106537110422847,0.10806653823319801,0.109640270634617,0.111259228701192,0.112926347492979,0.11464488888037,0.11641835944305,0.118249626221978,0.12013955762457799,0.122091800106612,0.124110523250838,0.12619664982637099,0.12835537786842099,0.13059314103821201,0.132910854882723,0.135314463521402,0.13780854619986699,0.1403994912123,0.143093225266507,0.14589178882480799,0.14880549038384799,0.15183810904688499,0.154997519898603,0.15829404898300101,0.16173885912625299,0.165340251220021,0.169113940363494,0.17307442536919199,0.177233811501879,0.181607341030082,0.186215169101664,0.19106939595132499,0.196192300691958,0.20161093599393201,0.20734448297859701,0.21341560806256499,0.21986081361323001,0.226722587887279,0.234048324247076,0.24189233136760599,0.25029532230490498,0.25933667351731998,0.26906875049717299,0.27955412015889503,0.29093095047580297,0.30331531304346199,0.31684813649592403,0.33171462761735099,0.34810088709923598,0.36632884872462002,0.38668424777828397,0.40942635460044402,0.435141462885964,0.46466630618300098,0.49870460439250502,0.53765704361516997,0.58208935041958398,0.634144440399108,0.69579600430235,0.77109272871923795,0.86071569686469696,0.95079818925219195,0.99999999999996003,1]
[0.125,9.0952288360702405E-2,9.2009468954220297E-2,9.3091624732650105E-2,9.4199660636684099E-2,9.5334078916653103E-2,9.6496093403724101E-2,9.7687113062075503E-2,9.8908645516363095E-2,0.100161766213367,0.101447303460314,0.102764680732557,0.104114287546257,0.105498877692339,0.106920451850484,0.108381580600276,0.1098830766143,0.11142815350273901,0.113017665684515,0.114652332922156,0.116335218455939,0.11806904256336,0.119856263624132,0.12169923388114599,0.123601465614016,0.12555989688224001,0.12758122049609999,0.12966870533934399,0.131828032792108,0.13405949733290301,0.13636726216262701,0.13875957240020201,0.14123898267894799,0.143813614176446,0.146483314818841,0.149258028159067,0.15214579391962099,0.15515086112580601,0.15828273605433199,0.16154289917681799,0.16494287528863399,0.16849784754118499,0.17221710424116499,0.17611276779666599,0.180193940717356,0.184477148622297,0.18898611386396,0.193724416651746,0.19871593754077699,0.20398202994261599,0.20953953494440899,0.215413131547359,0.22163216105129399,0.228241719166144,0.23527699713339401,0.24275726244125301,0.25074401862177698,0.25930180175641299,0.26848509727228997,0.27832835431082198,0.28893627345859002,0.30042470053298798,0.31291129129546202,0.32657309801066298,0.341535833640224,0.35786711879750799,0.37593799298768499,0.39607127673884801,0.41849384457420702,0.44368579544831799,0.47233636656758399,0.50537810505668501,0.54366699077161595,0.58801250782643599,0.63962089286124302,0.69774539204200003,0.76333209228380705,0.84027916939825598,0.91678806389315104,0.97901018440841103,0.99999999999996003,1]
[0.1875,9.56665584155586E-2,9.6783235322607797E-2,9.7927051098968904E-2,9.9097875863595794E-2,0.10029724156412199,0.101523265893182,0.10277980672175201,0.104067177319531,0.105387326354795,0.106741498861604,0.108129464479905,0.109553379376988,0.11101247295229399,0.112509735436941,0.114048571055603,0.11563257181827701,0.117263058656303,0.118940196149357,0.120664764326184,0.122437399895649,0.124264582622633,0.126147630849891,0.128090423618439,0.13009539387410199,0.132167085577028,0.134307105141656,0.13651610057598701,0.13880125509256999,0.141165733446633,0.143610562695209,0.14614710720410901,0.14877588468885899,0.15150564487252199,0.15433888203181001,0.15728265762302199,0.16033895415964,0.163518488648071,0.166832075914885,0.17028837570463201,0.17389848054142801,0.17767460468929699,0.18162587239941499,0.18577134577972201,0.19012113718330101,0.19469157395164,0.199497174740491,0.20454453902116401,0.20986485173334599,0.21545836787100001,0.22134926558249199,0.22758303952728601,0.23419951470644501,0.241227633239746,0.2487207555049,0.25670847147650999,0.265219633134539,0.274353003996471,0.28410722881550798,0.29463137594533501,0.30602123832392097,0.31839594876376798,0.331863735057011,0.34649068544179401,0.36248201789207102,0.38012258826547701,0.39964182064721598,0.42136814940364697,0.445457883058682,0.47265535172443401,0.50349958456395505,0.53885474351409701,0.57986311147547798,0.62726808705360504,0.68266202439329204,0.74412866418184298,0.81197591127274504,0.88287799191675398,0.94731236332850799,0.99349515988602999,0.99999999999996003,1]
[0.25,0.100158185280039,0.101325231672932,0.102519099396334,0.103740224182246,0.104990454329227,0.106270368886521,0.10758262087277,0.108929101989201,0.110309767253766,0.111726537285376,0.113179803252072,0.11467093852523901,0.11620259659006101,0.11777664778856201,0.119392743708562,0.121053974348378,0.122762232525293,0.124519604775622,0.126327893517585,0.12818976273625901,0.13010899542902199,0.13208691345420001,0.13412744944948199,0.13623251819716301,0.13840583382136701,0.140648690456427,0.142966102250663,0.14536538099223101,0.14784851874591901,0.150418739159912,0.153082652244451,0.15584342517139901,0.15871226925485299,0.16169122959087001,0.16478283871315499,0.167997754771054,0.17134374006648301,0.17483816071268399,0.17848319116948,0.18229340320564399,0.186281583892175,0.190453248534417,0.194827624762306,0.199408246249444,0.20419919201445799,0.20922779177283801,0.21450525078539001,0.22005257185175001,0.22589939471829201,0.23208578054203599,0.238655233411048,0.24562340869222701,0.25303411881683902,0.26091988039161701,0.26933152638351898,0.27835202985382701,0.288017826140884,0.298355891712768,0.30949765756429098,0.32155500330381098,0.33457035557102499,0.34875034068010502,0.36423111699500799,0.38121247852738599,0.39989007029691598,0.42065765513585501,0.44371023272993798,0.469308665868305,0.49801904485376203,0.53060268592472304,0.56794018771454902,0.61088687460975599,0.66082021996732498,0.71749819040406704,0.78031767972321397,0.84847006032694905,0.91308889800259596,0.96727364874037702,0.99921276512736001,0.99999999999996003,1]
{"$rows_left_out":76}